{"text_format":"3","workbook":"xlsx","n_sheets":17,"sheets":["Data Entry","Model tables","Calculations","Formulae","Daves pad 6 (Shikar mod)","Shikar scratchpad 5","Shikar scratchpad 5 (Dave mod)","Daves scratchpad 2","R series life","S series life","L series life","V series life","Basic life graph","Chart1"," Daves scratchpad 1","Daves scratchpad 3","Daves scratchpad 4"],"not_rendered":{"charts":45,"images":8,"external_links":2,"defined_names":52,"comments":1},"unopened":[{"sheet":"R series life","index":8,"reason":"not_a_worksheet"},{"sheet":"S series life","index":9,"reason":"not_a_worksheet"},{"sheet":"L series life","index":10,"reason":"not_a_worksheet"},{"sheet":"V series life","index":11,"reason":"not_a_worksheet"},{"sheet":"Chart1","index":13,"reason":"not_a_worksheet"}],"read":"whole","date_system":"1900"}

{"sheet":"Data Entry","index":0,"n_rows":62,"n_cols":38,"rows_kept":62,"merged":[[0,0,58,0],[0,1,0,11],[0,12,4,12],[0,13,1,22],[0,23,24,23],[0,24,0,26],[0,27,61,28],[0,29,1,29],[0,30,0,31],[0,35,0,36],[0,37,1,37],[1,1,1,3],[1,9,1,11],[2,2,2,3],[2,9,2,11],[2,13,2,14],[2,15,2,18],[2,20,2,21],[2,22,3,22],[3,2,3,3],[3,9,3,11],[3,13,3,14],[3,15,3,18],[3,20,3,21],[4,2,4,3],[4,9,4,11],[4,13,4,22],[5,1,5,22],[6,1,7,4],[6,5,7,5],[6,6,7,14],[6,15,7,15],[6,16,7,21],[6,22,7,22],[8,1,9,4],[8,5,21,5],[8,6,9,9],[8,10,21,10],[8,11,9,14],[8,15,21,15],[8,16,9,19],[8,20,21,20],[8,21,21,21],[8,22,21,22],[10,1,15,3],[10,4,14,4],[10,6,15,9],[10,11,17,14],[10,16,17,19],[10,29,11,29],[10,30,10,31],[12,32,19,32],[13,24,17,26],[15,4,16,4],[16,2,16,3],[16,6,18,7],[16,8,18,8],[16,9,18,9],[18,11,19,11],[18,12,19,12],[18,13,19,13],[18,14,21,14],[18,16,18,17],[18,18,18,19],[18,25,57,26],[19,4,21,4],[19,6,19,7],[19,16,19,17],[19,18,19,19],[20,6,20,7],[20,16,20,17],[20,18,20,19],[20,29,21,29],[20,30,20,31],[21,6,21,7],[21,16,21,17],[21,18,21,19],[21,24,24,24],[22,1,22,22],[22,32,27,32],[23,1,23,19],[23,20,23,22],[24,1,24,22],[25,1,25,24],[26,1,26,3],[26,4,26,6],[26,7,26,9],[26,10,26,12],[26,13,26,16],[26,17,26,20],[26,21,26,24],[27,1,27,3],[27,4,27,6],[27,7,27,9],[27,10,27,12],[27,13,27,16],[27,17,27,20],[27,21,27,24],[28,1,28,3],[28,4,28,6],[28,7,28,9],[28,10,28,12],[28,13,28,16],[28,17,28,20],[28,21,28,24],[28,29,29,29],[28,30,28,31],[29,1,29,3],[29,4,29,6],[29,7,29,9],[29,10,29,12],[29,13,29,16],[29,17,29,20],[29,21,29,24],[29,30,29,31],[30,1,30,3],[30,4,30,6],[30,7,30,9],[30,10,30,12],[30,13,30,16],[30,17,30,20],[30,21,30,24],[30,30,30,31],[31,1,31,3],[31,4,31,6],[31,7,31,9],[31,10,31,12],[31,13,31,16],[31,17,31,20],[31,21,31,24],[31,30,31,31],[32,1,32,3],[32,4,32,6],[32,7,32,9],[32,10,32,12],[32,13,32,16],[32,17,32,20],[32,21,32,24],[32,30,32,31],[33,1,33,3],[33,4,33,6],[33,7,33,9],[33,10,33,12],[33,13,33,16],[33,17,33,20],[33,21,33,24],[33,30,33,31],[34,1,34,3],[34,4,34,6],[34,7,34,9],[34,10,34,12],[34,13,34,16],[34,17,34,20],[34,21,34,24],[34,30,34,31],[35,1,35,3],[35,4,35,6],[35,7,35,9],[35,10,35,12],[35,13,35,16],[35,17,35,20],[35,21,35,24],[35,30,35,31],[36,1,36,3],[36,4,36,6],[36,7,36,9],[36,10,36,12],[36,13,36,16],[36,17,36,20],[36,21,36,24],[36,30,36,31],[37,1,58,3],[37,4,37,6],[37,7,37,9],[37,10,37,12],[37,13,37,16],[37,17,37,20],[37,21,37,24],[37,30,37,31],[38,4,38,6],[38,7,38,9],[38,10,38,12],[38,13,38,16],[38,17,38,20],[38,21,38,24],[38,30,38,31],[39,4,57,6],[39,7,39,9],[39,10,39,12],[39,13,39,16],[39,17,39,20],[39,21,39,24],[39,30,39,31],[40,7,40,9],[40,10,40,12],[40,13,40,16],[40,17,40,20],[40,21,40,24],[40,30,40,31],[41,7,41,9],[41,10,41,12],[41,13,41,16],[41,17,41,20],[41,21,41,24],[41,30,41,31],[42,7,42,9],[42,10,42,12],[42,13,42,16],[42,17,42,20],[42,21,42,24],[42,30,42,31],[43,7,43,9],[43,10,43,12],[43,13,43,16],[43,17,43,20],[43,21,43,24],[43,30,43,31],[44,7,44,9],[44,10,44,12],[44,13,44,16],[44,17,44,20],[44,21,44,24],[44,29,45,29],[44,30,44,31],[44,35,45,35],[45,7,45,9],[45,10,45,12],[45,13,45,16],[45,17,45,20],[45,21,57,24],[46,7,46,9],[46,10,46,12],[46,13,46,16],[46,17,46,20],[47,7,47,9],[47,10,47,12],[47,13,47,16],[47,17,47,20],[48,7,48,9],[48,10,48,12],[48,13,48,16],[48,17,48,20],[49,7,49,9],[49,10,49,12],[49,13,49,16],[49,17,49,20],[50,7,50,9],[50,10,57,12],[50,13,50,16],[50,17,50,20],[51,7,57,9],[51,13,51,16],[51,17,57,20],[52,13,52,16],[53,13,53,16],[54,13,54,16],[54,35,61,35],[55,13,55,16],[56,13,56,16],[57,13,57,16],[58,4,58,26],[59,0,62,26]]}
[null,"SERVICE LIFE CALCULATION",{"$nulls":22},"Document Revision History",{"$nulls":4},"TCAE-R SERIES","DBSE",null,"Weight","Dia","DBSE","Shaft Size / \nBore Size ",null,"To Suit\nTaperlock Size"]
[{"$nulls":4},"SELECTED",null,"LIFE HOURS","FIT FOR USE","MAX RPM","DBSE RANGE [mm]",{"$nulls":14},"A","Draft release","06/12/2019",{"$nulls":3},"min","max","[kg]","[mm]","range","[mm]","[in]"]
[null,{"$f":"IF(E3=\"\", \"\",\"OPTION 1\")","v":""},{"$f":"IF(B3=\"\",\"\",\"Meets all input criteria\")","v":""},null,{"$f":"IF(OR(TYPE=\"CLICK HERE\",D18=\"CLICK HERE\",D20=\"CLICK HERE\",MSF=\"CLICK HERE\"),\"\",IF('Model tables'!C29=\"-\",\"\",'Model tables'!C29))","v":""},null,{"$f":"IF(OR(TYPE=\"CLICK HERE\",D18=\"CLICK HERE\",D20=\"CLICK HERE\",MSF=\"CLICK HERE\"),\"\",IF('Model tables'!C29=\"-\",\"\",IF('Model tables'!D29*hourpa>=25000, \"25,000\",'Model tables'!D29*hourpa)))","v":""},{"$f":"IF(G3=\"\",\"\",IF(AND(G3/hourpa>=1,G3/hourpa<2),\" 1-2 yrs\",IF(AND(G3/hourpa>=2,G3/hourpa<3),\" 2-3 yrs\",\"> 3 yrs\")))","v":""},{"$f":"IF(G3=\"\",\"\",IFERROR(INDEX('Model tables'!E16:E31,MATCH('Data Entry'!E3,'Model tables'!C16:C31,0)),\"-\"))","v":""},{"$f":"IFERROR(INDEX(AI1:AI62,MATCH(E3,AD1:AD62,0)),\"\")","v":""},{"$nulls":3},"Customer Name:",{"$nulls":5},"Date:",{"$nulls":4},"B","Warranty period formula changed","2019-12-19",null,null,"TCAE-R-1",{"$f":"'Model tables'!H12","v":130},{"$f":"'Model tables'!I12","v":140},{"$f":"'Model tables'!L12","v":{"v":1.8999999999999995,"d":"2"}},{"$f":"'Model tables'!M12","v":148},{"$f":"CONCATENATE('Model tables'!N12,\" (\",AE3,\"-\",AF3,\")\")","v":"135 (130-140)"},"16 to 65","0.625 to 2.5","#2517"]
[null,{"$f":"IF(E4=\"\", \"\",IF(B3=\"OPTION 1\", \"OPTION 2\",\"OPTION 1\"))","v":""},{"$f":"IF(B4=\"\",\"\",IF(E4='Model tables'!C16,\"Meets all input criteria\",IF(E4='Model tables'!C18,\"Meets all input criteria\",\"DBSE change required\")))","v":""},null,{"$f":"IF(OR(TYPE=\"CLICK HERE\",D18=\"CLICK HERE\",D20=\"CLICK HERE\",MSF=\"CLICK HERE\"),\"\",IF('Model tables'!C30=\"-\",\"\",'Model tables'!C30))","v":""},null,{"$f":"IF(OR(TYPE=\"CLICK HERE\",D18=\"CLICK HERE\",D20=\"CLICK HERE\",MSF=\"CLICK HERE\"),\"\",IF('Model tables'!C30=\"-\",\"\",IF('Model tables'!D30*hourpa>=25000, \"25,000\",'Model tables'!D30*hourpa)))","v":""},{"$f":"IF(G4=\"\",\"\",IF(AND(G4/hourpa>=1,G4/hourpa<2),\" 1-2 yrs\",IF(AND(G4/hourpa>=2,G4/hourpa<3),\" 2-3 yrs\",\"> 3 yrs\")))","v":""},{"$f":"IF(G4=\"\",\"\",IFERROR(INDEX('Model tables'!E16:E316,MATCH('Data Entry'!E4,'Model tables'!C16:C31,0)),\"-\"))","v":""},{"$f":"IFERROR(INDEX(AI1:AI62,MATCH(E4,AD1:AD62,0)),\"\")","v":""},{"$nulls":3},"Distributor Name:",{"$nulls":5},"Ref #:",{"$nulls":4},"C","Procedure page","2019-12-23",null,null,"TCAE-R-2",{"$f":"'Model tables'!H13","v":155},{"$f":"'Model tables'!I13","v":175},{"$f":"'Model tables'!L13","v":{"v":9.899999999999999,"d":"10"}},{"$f":"'Model tables'!M13","v":178},{"$f":"CONCATENATE('Model tables'!N13,\" (\",AE4,\"-\",AF4,\")\")","v":"165 (155-175)"},"16 to 65","0.62 to 2.5","#2517"]
[null,{"$f":"IF(E5=\"\",\"\",IF(B4=\"OPTION 1\",\"OPTION 2\",IF(B4=\"OPTION 2\",\"OPTION 3\",IF(B3=\"OPTION 1\",\"OPTION 2\",\"OPTION 1\"))))","v":""},{"$f":"IF(B5=\"\",\"\",IF(E5='Model tables'!C16,\"Meets all input criteria\",IF(E5='Model tables'!C18,\"Meets all input criteria\",\"DBSE change required\")))","v":""},null,{"$f":"IF(OR(TYPE=\"CLICK HERE\",D18=\"CLICK HERE\",D20=\"CLICK HERE\",MSF=\"CLICK HERE\"),\"\",IF('Model tables'!C31=\"-\",\"\",'Model tables'!C31))","v":""},null,{"$f":"IF(OR(TYPE=\"CLICK HERE\",D18=\"CLICK HERE\",D20=\"CLICK HERE\",MSF=\"CLICK HERE\"),\"\",IF('Model tables'!C31=\"-\",\"\",IF('Model tables'!D31*hourpa>=25000, \"25,000\",'Model tables'!D31*hourpa)))","v":""},{"$f":"IF(G5=\"\",\"\",IF(AND(G5/hourpa>=1,G5/hourpa<2),\" 1-2 yrs\",IF(AND(G5/hourpa>=2,G5/hourpa<3),\" 2-3 yrs\",\"> 3 yrs\")))","v":""},{"$f":"IF(G5=\"\",\"\",IFERROR(INDEX('Model tables'!E16:E31,MATCH('Data Entry'!E5,'Model tables'!C16:C31,0)),\"-\"))","v":""},{"$f":"IFERROR(INDEX(AI1:AI62,MATCH(E5,AD1:AD62,0)),\"\")","v":""},{"$nulls":14},2,"Released","2019-12-30",null,null,"TCAE-R-3",{"$f":"'Model tables'!H14","v":285},{"$f":"'Model tables'!I14","v":305},{"$f":"'Model tables'!L14","v":{"v":20.5,"d":"21"}},{"$f":"'Model tables'!M14","v":215},{"$f":"CONCATENATE('Model tables'!N14,\" (\",AE5,\"-\",AF5,\")\")","v":"295 (285-305)"},"25 to 75","1.0 to 3.0","#3020"]
[null,"Message Bar:",{"$nulls":22},3,"Fixed error in R series","2020-01-19",null,null,"TCAE-R-4",{"$f":"'Model tables'!H15","v":285},{"$f":"'Model tables'!I15","v":305},{"$f":"'Model tables'!L15","v":{"v":28.3,"d":"28"}},{"$f":"'Model tables'!M15","v":253},{"$f":"CONCATENATE('Model tables'!N15,\" (\",AE6,\"-\",AF6,\")\")","v":"295 (285-305)"},"35 to 100","1.5 to 4.0","#3525"]
[null,{"$f":"IF(TYPE=\"CLICK HERE\",\"Check Motor Type Details\",IF(D18=\"CLICK HERE\",\"Check Motor Power unit\",IF(D20=\"CLICK HERE\",\"Check Motor Shaft Diameter unit\",IF(MSF=\"CLICK HERE\",\"Check Machine Service Factor\",IF(AND('Model tables'!C29=\"-\",'Model tables'!C30=\"-\",'Model tables'!C31=\"-\"),\"DBSE is not achievable for the input selected OR unable to select a suitable coupling\",\"\")))))","v":"Check Motor Type Details"},{"$nulls":4},{"$f":"IF(B7=\"DBSE is not achievable for the input selected OR unable to select a suitable coupling\",\"If possible to move either Drive or Driven device to change DBSE, an alternative model may be found.  See DBSE’s on right side\",IF(B7=\"\",\"\",\"\"))","v":""},{"$nulls":9},{"$f":"IF(B7=\"DBSE is not achievable for the input selected OR unable to select a suitable coupling\",\"Please enter new DBSE OR Please contact the distributor / manufacturer\",\"\")","v":""},{"$nulls":7},4,"Changed Layout","2020-04-23",null,null,"TCAE-R-5",{"$f":"'Model tables'!H16","v":300},{"$f":"'Model tables'!I16","v":330},{"$f":"'Model tables'!L16","v":{"v":38.6,"d":"39"}},{"$f":"'Model tables'!M16","v":278},{"$f":"CONCATENATE('Model tables'!N16,\" (\",AE7,\"-\",AF7,\")\")","v":"315 (300-330)"},"35 to 100","1.5 to 4.0","#3525"]
[{"$nulls":24},5,"Fixed error in R series","07/05/2020",null,null,"TCAE-R-6",{"$f":"'Model tables'!H17","v":277},{"$f":"'Model tables'!I17","v":305},{"$f":"'Model tables'!L17","v":{"v":43.34,"d":"43"}},{"$f":"'Model tables'!M17","v":300},{"$f":"CONCATENATE('Model tables'!N17,\" (\",AE8,\"-\",AF8,\")\")","v":"291 (277-305)"},"35 to 100","1.5 to 4.0","#3525"]
[null,"MOTOR DETAILS",{"$nulls":4},"DRIVEN SHAFT DETAILS",{"$nulls":4},"IF GEARBOX CONNECTED",{"$nulls":4},"MACHINE OPERATIONAL DUTY TIME",{"$nulls":4},"D\nA\nT\nA \n\nE\nN\nT\nR\nY",null,null,6,"Fixed error in R series","2020-05-21",null,null,"TCAE-R-7",{"$f":"'Model tables'!H18","v":330},{"$f":"'Model tables'!I18","v":358},{"$f":"'Model tables'!L18","v":{"v":59.8,"d":"60"}},{"$f":"'Model tables'!M18","v":330},{"$f":"CONCATENATE('Model tables'!N18,\" (\",AE9,\"-\",AF9,\")\")","v":"344 (330-358)"},"35 to 100","1.5 to 4.0","#3525"]
[{"$nulls":24},7,"mm & inches added","2020-05-23",null,null,"TCAE-R-8",{"$f":"'Model tables'!H19","v":330},{"$f":"'Model tables'!I19","v":358},{"$f":"'Model tables'!L19","v":{"v":62.34,"d":"62"}},{"$f":"'Model tables'!M19","v":370},{"$f":"CONCATENATE('Model tables'!N19,\" (\",AE10,\"-\",AF10,\")\")","v":"344 (330-358)"},"35 to 100","1.5 to 4.0","#3525"]
[{"$nulls":24},8,"Format Change","2021-01-13",null,null,"TCAE-L SERIES","DBSE",null,"Weight","Dia","DBSE"]
[{"$nulls":24},9,"Updated R,L,V,S series\nFormat change","2021-07-27",{"$nulls":3},"min","max","[kg]","[mm]","range"]
[{"$nulls":24},10,"Updated V-series\nNew service life periods","2021-11-01",null,null,"TCAE-L-1",{"$f":"'Model tables'!H95","v":307},{"$f":"'Model tables'!I95","v":1800},"L dependant",{"$f":"'Model tables'!M95","v":148},{"$f":"CONCATENATE(\" (\",AE13,\"-\",AF13,\")\")","v":" (307-1800)"}]
[{"$nulls":29},"TCAE-L-2",{"$f":"'Model tables'!H96","v":386},{"$f":"'Model tables'!I96","v":2000},null,{"$f":"'Model tables'!M96","v":178}," (386-2000)"]
[{"$nulls":29},"TCAE-L-3",{"$f":"'Model tables'!H97","v":429},{"$f":"'Model tables'!I97","v":2000},null,{"$f":"'Model tables'!M97","v":215}," (429-2000)"]
[{"$nulls":4},{"$f":"IF(OR(TYPE=Calculations!G8,TYPE=Calculations!G9,TYPE=Calculations!G10,TYPE=Calculations!G11),\"Enter Peak Engine Torque Below\",\"\")","v":""},{"$nulls":24},"TCAE-L-4",{"$f":"'Model tables'!H98","v":473},{"$f":"'Model tables'!I98","v":2000},null,{"$f":"'Model tables'!M98","v":253}," (473-2000)"]
[null,"TYPE","CLICK HERE",{"$nulls":3},"DISTANCE BETWEEN SHAFT ENDS (MOTOR TO DRIVEN SHAFT OR GEARBOX TO DRIVEN SHAFT)",null,null,{"$f":"IF(D20=\"CLICK HERE\",\"\",D20)","v":""},{"$nulls":19},"TCAE-L-5",{"$f":"'Model tables'!H99","v":500},{"$f":"'Model tables'!I99","v":2000},null,{"$f":"'Model tables'!M99","v":278}," (500-2000)"]
[null,"POWER",null,"CLICK HERE",{"$nulls":25},"TCAE-L-6",{"$f":"'Model tables'!H100","v":582},{"$f":"'Model tables'!I100","v":2000},null,{"$f":"'Model tables'!M100","v":300}," (582-2000)"]
[null,"SPEED",null,"RPM","-",{"$nulls":6},"SHAFT DIAMETER",null,{"$f":"IF(D20=\"CLICK HERE\",\"\",D20)","v":""},null,null,"HOURS PER DAY",{"$nulls":12},"TCAE-L-7",{"$f":"'Model tables'!H101","v":643},{"$f":"'Model tables'!I101","v":2000},null,{"$f":"'Model tables'!M101","v":330}," (643-2000)"]
[null,"SHAFT DIAMETER",null,"CLICK HERE",null,null,"DRIVEN SHAFT DIAMETER",null,null,{"$f":"IF(D20=\"CLICK HERE\",\"\",D20)","v":""},{"$nulls":6},"DAYS PER WEEK",{"$nulls":7},"Manual Entry",{"$nulls":4},"TCAE-L-8",{"$f":"'Model tables'!H102","v":760},{"$f":"'Model tables'!I102","v":2000},null,{"$f":"'Model tables'!M102","v":370}," (760-2000)"]
[null,"SHAFT ANGLE DEGREES",null,"≤ 5⁰",null,null,"MACHINE DUTY SERVICE TYPE",null,"CLICK HERE","SEE EXAMPLES BELOW",null,"INPUT THE RATIO TO 1",{"$nulls":4},"WEEKS PER YEAR",{"$nulls":7},"Drop-down \nMenu",{"$nulls":4},"TCAE-CM SERIES","DBSE",null,"Weight","Dia","DBSE"]
[null,"FREQUENT START/STOP OR REVERSING LOADS","CLICK HERE","SELECT\nY / N",null,null,"MACHINE SERVICE FACTOR",null,{"$f":"IFERROR(IF(C22=\"Y\", MAX(2,VLOOKUP(I21,Calculations!G14:H20,2)),VLOOKUP(I21,Calculations!G14:H20,2)),\"-\")","v":"-"},null,null,"FINAL SPEED",{"$f":"IF(RATIO=\"\",SPEED,SPEED/RATIO)","v":0},"RPM",null,null,"TOTAL HOURS PA",null,{"$f":"hours*days*weeks","v":0},{"$nulls":11},"min","max","[kg]","[mm]","range"]
[{"$nulls":29},"TCAE-CM-9",{"$f":"'Model tables'!H119","v":535},{"$f":"'Model tables'!I119","v":2500},"L dependant",{"$f":"'Model tables'!M119","v":336},{"$f":"CONCATENATE(\" (\",AE23,\"-\",AF23,\")\")","v":" (535-2500)"}]
[null,"The DBSE (minimum and maximum) for our TCAE-S, TCAE-V, TCAE-R, TCAE-L and TCAE-CM Series Couplings are listed in the columns AD-AL on the right.   \nPrint and send to us or call +61 7 3040 8066.  ",{"$nulls":18},"©TCL  2021",{"$nulls":8},"TCAE-CM-10",{"$f":"'Model tables'!H120","v":570},{"$f":"'Model tables'!I120","v":2500},null,{"$f":"'Model tables'!M120","v":376}," (570-2500)"]
[{"$nulls":29},"TCAE-CM-11",{"$f":"'Model tables'!H121","v":650},{"$f":"'Model tables'!I121","v":3000},null,{"$f":"'Model tables'!M121","v":420}," (650-3000)"]
[null,"MACHINE DUTY SERVICE TYPE",{"$nulls":27},"TCAE-CM-12",{"$f":"'Model tables'!H122","v":715},{"$f":"'Model tables'!I122","v":3000},null,{"$f":"'Model tables'!M122","v":462}," (715-3000)"]
[null,"SMOOTH",null,null,"LIGHT DUTY",null,null,"MODERATE DUTY",null,null,"MEDIUM DUTY",null,null,"HEAVYDUTY",{"$nulls":3},"VERY HEAVY DUTY",{"$nulls":3},"EXTREME SHOCK",{"$nulls":7},"TCAE-CM-13",{"$f":"'Model tables'!H123","v":770},{"$f":"'Model tables'!I123","v":3000},null,{"$f":"'Model tables'!M123","v":504}," (770-3000)"]
[null,"Agitators",null,null,"Belt conveyors",null,null,"Beaters",null,null,"Concrete mixers",null,null,"Barge pullers",{"$nulls":3},"Ball mill drive",{"$nulls":3},"Conveyors - reciprocating",{"$nulls":7},"TCAE-CM-14",{"$f":"'Model tables'!H124","v":840},{"$f":"'Model tables'!I124","v":3000},null,{"$f":"'Model tables'!M124","v":580}," (840-3000)"]
[null,"Blowers-centrifugal",null,null,"Blowers-Vane",null,null,"Blowers- lobe",null,null,"Dredge - screen drives",null,null,"Cranes - main hoist",{"$nulls":3},"Crushers -ore",{"$nulls":3},"Conveyors - shaking/live roll",{"$nulls":7},"TCAE-S SERIES","DBSE",null,"Weight","Dia ","DBSE","Bore D"]
[null,"Evaporators",null,null,"compressor -centrifugal",null,null,"Bucket conveyor",null,null,"Dredge - stacker",null,null,"Cranes -reversing",{"$nulls":3},"Crushers -stone",{"$nulls":3},"Metal rolling - feed rolls",{"$nulls":8},"[mm]",null,"[kg]","[mm]","range","[mm] "]
[null,"Fans . Centrifugal",null,null,"Fans -Induced draft",null,null,"Compressor - lobe",null,null,"Dredge - cable reels",null,null,"Elevator -freight",{"$nulls":3},"Dredge - cutter head",{"$nulls":3},"Metal rolling - reversing rolls",{"$nulls":7},{"$f":"'Model tables'!I36","v":"TCAE-S-1 + Spacer"},{"$f":"'Model tables'!M36","v":10},null,{"$f":"'Model tables'!K36","v":{"v":4.8,"d":"5"}},{"$f":"'Model tables'!L36","v":152},{"$f":"CONCATENATE('Model tables'!O36,\" (min) \")","v":"10 (min) "},{"$f":"'Model tables'!H36","v":30}]
[null,"Pumps - Centrifugal",null,null,"Feeders",null,null,"Dredge - conveyor",null,null,"Dredge - winches",null,null,"Fans - cooling tower",{"$nulls":3},"Feeder - reciprocating",{"$nulls":3},"Metal rolling - hot mills",{"$nulls":7},{"$f":"'Model tables'!I37","v":"TCAE-S-2 + Spacer"},{"$f":"'Model tables'!M37","v":10},null,{"$f":"'Model tables'!K37","v":{"v":8.52,"d":"9"}},{"$f":"'Model tables'!L37","v":179},{"$f":"CONCATENATE('Model tables'!O37,\" (min) \")","v":"10 (min) "},{"$f":"'Model tables'!H37","v":40}]
[null,"Screens - Air washer",null,null,"Machine-tool drives",null,null,"Fans - propellor",null,null,"Elevator -bucket",null,null,"Generator - welding",{"$nulls":3},"Machine tool - tappers",{"$nulls":3},"Metal, rolling - Manipulators",{"$nulls":7},{"$f":"'Model tables'!I38","v":"TCAE-S-3 + Spacer"},{"$f":"'Model tables'!M38","v":10},null,{"$f":"'Model tables'!K38","v":{"v":14.7,"d":"15"}},{"$f":"'Model tables'!L38","v":215},{"$f":"CONCATENATE('Model tables'!O38,\" (min) \")","v":"10 (min) "},{"$f":"'Model tables'!H38","v":50}]
[null,"Steering gear",null,null,"Oil industry chillers",null,null,"Fans -forced draft",null,null,"Hoist - bridge drive",null,null,"Hammer mills",{"$nulls":3},"Metal forming - Table conveyors",{"$nulls":3},"Metal rolling - merchant mill",{"$nulls":7},{"$f":"'Model tables'!I39","v":"TCAE-S-4 + Spacer"},{"$f":"'Model tables'!M39","v":10},null,{"$f":"'Model tables'!K39","v":18},{"$f":"'Model tables'!L39","v":236},{"$f":"CONCATENATE('Model tables'!O39,\" (min) \")","v":"10 (min) "},{"$f":"'Model tables'!H39","v":55}]
[null,"Stokers",null,null,"Paper mill - agitators",null,null,"Line shaft conveyor",null,null,"Hoist - skip",null,null,"Laundry washer",{"$nulls":3},"Metal rolling - furnace pushers",{"$nulls":3},"Metal rolling - piercers",{"$nulls":7},{"$f":"'Model tables'!I40","v":"TCAE-S-5 + Spacer"},{"$f":"'Model tables'!M40","v":10},null,{"$f":"'Model tables'!K40","v":{"v":33.2,"d":"33"}},{"$f":"'Model tables'!L40","v":270},{"$f":"CONCATENATE('Model tables'!O40,\" (min) \")","v":"10 (min) "},{"$f":"'Model tables'!H40","v":60}]
[null,"Rubber plant - Tyre press opener",null,null,"Paper mill - conveyors",null,null,"Metal forming - slitters",null,null,"Hoist - trolley drive",null,null,"Machine tool - bending rolls",{"$nulls":3},"Metal rolling- ingot cars",{"$nulls":3},"Metal rolling - reelers",{"$nulls":7},{"$f":"'Model tables'!I41","v":"TCAE-S-6 + Spacer"},{"$f":"'Model tables'!M41","v":10},null,{"$f":"'Model tables'!K41","v":{"v":27.85,"d":"28"}},{"$f":"'Model tables'!L41","v":244},{"$f":"CONCATENATE('Model tables'!O41,\" (min) \")","v":"10 (min) "},{"$f":"'Model tables'!H41","v":65}]
[null,"Woodworking machinery",null,null," Screens - Travelling water",null,null,"Metal forming- wire winder",null,null,"Metal forming -wire winder",null,null,"Machine tool - punch press",{"$nulls":3},"Metal rolling - kick outs",{"$nulls":3},"Metal rolling - rod & bar molls",{"$nulls":7},{"$f":"'Model tables'!I42","v":"TCAE-S-7 + Spacer"},{"$f":"'Model tables'!M42","v":10},null,{"$f":"'Model tables'!K42","v":{"v":37.3,"d":"37"}},{"$f":"'Model tables'!L42","v":272},{"$f":"CONCATENATE('Model tables'!O42,\" (min) \")","v":"10 (min) "},{"$f":"'Model tables'!H42","v":65}]
[{"$nulls":4},"Sewage disposal equipment",null,null,"Metal rolling - coilers (cold)",null,null,"Metal rolling - cooler beds",null,null,"Metal forming- draw bench drive",{"$nulls":3},"Metal rolling - pusher rams",{"$nulls":3},"Metal rolling - roughing mill feed rolls",{"$nulls":7},{"$f":"'Model tables'!I43","v":"TCAE-S-8 + Spacer"},{"$f":"'Model tables'!M43","v":10},null,{"$f":"'Model tables'!K43","v":52},{"$f":"'Model tables'!L43","v":292},{"$f":"CONCATENATE('Model tables'!O43,\" (min) \")","v":"10 (min) "},{"$f":"'Model tables'!H43","v":85}]
[{"$nulls":4},"Textile dyeing machines",null,null,"Metal rolling- wire drawing",null,null,"Metal rolling - edger drive",null,null,"Metal forming -extruder",{"$nulls":3},"Metal rolling - runout tables",{"$nulls":3},"Metal rolling – screwdown drive rolls",{"$nulls":7},{"$f":"'Model tables'!I44","v":"TCAE-S-9 + Spacer"},{"$f":"'Model tables'!M44","v":10},null,{"$f":"'Model tables'!K44","v":80},{"$f":"'Model tables'!L44","v":336},{"$f":"CONCATENATE('Model tables'!O44,\" (min) \")","v":"10 (min) "},{"$f":"'Model tables'!H44","v":110}]
[{"$nulls":7},"Multers",null,null,"Metal rolling - reel drives",null,null,"Metal rolling - coiler (hot)",{"$nulls":3},"Metal rolling - saws",{"$nulls":3},"Metal rolling - skelp mills",{"$nulls":7},{"$f":"'Model tables'!I45","v":"TCAE-S-10 + Spacer"},{"$f":"'Model tables'!M45","v":10},null,{"$f":"'Model tables'!K45","v":{"v":113.2,"d":"113"}},{"$f":"'Model tables'!L45","v":376},{"$f":"CONCATENATE('Model tables'!O45,\" (min) \")","v":"10 (min) "},{"$f":"'Model tables'!H45","v":125}]
[{"$nulls":7},"Paper mill - converters",null,null,"Oil industry filter press",null,null,"Metal rolling - door openers",{"$nulls":3},"Metal rolling – straighteners",{"$nulls":3},"Metal rolling - slitter rolls",{"$nulls":7},{"$f":"'Model tables'!I46","v":"TCAE-S-11 + Spacer"},{"$f":"'Model tables'!M46","v":10},null,{"$f":"'Model tables'!K46","v":{"v":119.8,"d":"120"}},{"$f":"'Model tables'!L46","v":420},{"$f":"CONCATENATE('Model tables'!O46,\" (min) \")","v":"10 (min) "},{"$f":"'Model tables'!H46","v":130}]
[{"$nulls":7},"Paper mill - reelers",null,null,"Paper mill - beater/pulper",null,null,"Metal rolling - reel drums",{"$nulls":3},"Metal rolling - transfer tables",{"$nulls":3},"Metal rolling - slabbing molls",{"$nulls":7},{"$f":"'Model tables'!I47","v":"TCAE-S-12 + Spacer"},{"$f":"'Model tables'!M47","v":10},null,{"$f":"'Model tables'!K47","v":{"v":172.9,"d":"173"}},{"$f":"'Model tables'!L47","v":462},{"$f":"CONCATENATE('Model tables'!O47,\" (min) \")","v":"10 (min) "},{"$f":"'Model tables'!H47","v":150}]
[{"$nulls":7},"Paper mill - winders",null,null,"Paper mill - dryers",null,null,"Metal rolling -draw bench",{"$nulls":3},"Metal rolling - tube conveyor rolls",{"$nulls":3},"Metal rolling - soaking pit drive",{"$nulls":7},{"$f":"'Model tables'!I48","v":"TCAE-S-13 + Spacer"},{"$f":"'Model tables'!M48","v":10},null,{"$f":"'Model tables'!K48","v":0},{"$f":"'Model tables'!L48","v":504},{"$f":"CONCATENATE('Model tables'!O48,\" (min) \")","v":"10 (min) "},{"$f":"'Model tables'!H48","v":170}]
[{"$nulls":7},"Printing presses",null,null,"Paper mill - jordans",null,null,"Mills - cement/kiln",{"$nulls":3},"Metal rolling- unscramblers",{"$nulls":3},"Metal rolling - thrust block drove",{"$nulls":7},{"$f":"'Model tables'!I49","v":"TCAE-S-14 + Spacer"},{"$f":"'Model tables'!M49","v":10},null,{"$f":"'Model tables'!K49","v":0},{"$f":"'Model tables'!L49","v":580},{"$f":"CONCATENATE('Model tables'!O49,\" (min) \")","v":"10 (min) "},{"$f":"'Model tables'!H49","v":200}]
[{"$nulls":7},"Pumps - Gear/rotary/Vane",null,null,"pumps - reciproc - 3 cyl+",null,null,"Mills - pebble",{"$nulls":3},"Paper Mills - barker drum gear",{"$nulls":3},"Metal rolling - Traction drive",{"$nulls":7},"TCAE-V SERIES","DBSE",null,"Weight","Dia ","DBSE","To Suit\nTaperlock Size"]
[{"$nulls":7},"Screens - Rotary stone/gravel",null,null,"Timber - planer",null,null,"Mills - tube",{"$nulls":3},"Paper Mills - chipper drive",{"$nulls":12},"min","max","[kg]","[mm]","range"]
[{"$nulls":7},"Screw conveyor",null,null,"Timber - slab conveyor",null,null,"Mills - tumbling",{"$nulls":3},"Pumps - reciproc - 2cyl",{"$nulls":11},{"$f":"'Model tables'!J62","v":"TCAE-V-00"},{"$f":"'Model tables'!H62","v":74},{"$f":"'Model tables'!I62","v":80},{"$f":"'Model tables'!L62","v":{"v":1.9,"d":"2"}},{"$f":"'Model tables'!M62","v":118},{"$f":"CONCATENATE('Model tables'!N62,\" (\",AE47,\"-\",AF47,\")\")","v":"77 (74-80)"},"#1615"]
[{"$nulls":7},"Shredders",null,null,"Timber - trimmer feed",null,null,"Mills- dryers/coolers",{"$nulls":3},"Rubber plant - rubber mill",{"$nulls":11},{"$f":"'Model tables'!J63","v":"TCAE-V-0"},{"$f":"'Model tables'!H63","v":84},{"$f":"'Model tables'!I63","v":92},{"$f":"'Model tables'!L63","v":{"v":2.9,"d":"3"}},{"$f":"'Model tables'!M63","v":134},{"$f":"CONCATENATE('Model tables'!N63,\" (\",AE48,\"-\",AF48,\")\")","v":"88 (84-92)"},"#1615"]
[{"$nulls":7},"Textile machinery - dryers",null,null,"Tumblers – barrel",null,null,"Mills- rolling",{"$nulls":3},"Rubber plant - mixers",{"$nulls":11},{"$f":"'Model tables'!J64","v":"TCAE-V-1"},{"$f":"'Model tables'!H64","v":96},{"$f":"'Model tables'!I64","v":108},{"$f":"'Model tables'!L64","v":{"v":4.4,"d":"4"}},{"$f":"'Model tables'!M64","v":152},{"$f":"CONCATENATE('Model tables'!N64,\" (\",AE49,\"-\",AF49,\")\")","v":"102 (96-108)"},"#2517"]
[{"$nulls":7},"Timber - sorting table",null,null,"Windlasses",null,null,"Paper mills – barker mechanical",{"$nulls":3},"Rubber plant -tyre builder m/c",{"$nulls":11},{"$f":"'Model tables'!J65","v":"TCAE-V-2"},{"$f":"'Model tables'!H65","v":117},{"$f":"'Model tables'!I65","v":129},{"$f":"'Model tables'!L65","v":{"v":7.3,"d":"7"}},{"$f":"'Model tables'!M65","v":177},{"$f":"CONCATENATE('Model tables'!N65,\" (\",AE50,\"-\",AF50,\")\")","v":"123 (117-129)"},"#2517"]
[{"$nulls":7},"Utility winches",{"$nulls":5},"Paper mills – log haul drives",{"$nulls":3},"Screens - vibrating",{"$nulls":11},{"$f":"'Model tables'!J66","v":"TCAE-V-3"},{"$f":"'Model tables'!H66","v":140},{"$f":"'Model tables'!I66","v":156},{"$f":"'Model tables'!L66","v":{"v":13.4,"d":"13"}},{"$f":"'Model tables'!M66","v":215},{"$f":"CONCATENATE('Model tables'!N66,\" (\",AE51,\"-\",AF51,\")\")","v":"148 (140-156)"},"#3020"]
[{"$nulls":13},"Paper mills - super calendars",{"$nulls":15},{"$f":"'Model tables'!J67","v":"TCAE-V-4"},{"$f":"'Model tables'!H67","v":162},{"$f":"'Model tables'!I67","v":178},{"$f":"'Model tables'!L67","v":{"v":24.5,"d":"25"}},{"$f":"'Model tables'!M67","v":236},{"$f":"CONCATENATE('Model tables'!N67,\" (\",AE52,\"-\",AF52,\")\")","v":"170 (162-178)"},"#3525"]
[{"$nulls":13},"Paper mills -calendars",{"$nulls":15},{"$f":"'Model tables'!J68","v":"TCAE-V-5"},{"$f":"'Model tables'!H68","v":196},{"$f":"'Model tables'!I68","v":212},{"$f":"'Model tables'!L68","v":{"v":36.2,"d":"36"}},{"$f":"'Model tables'!M68","v":270},{"$f":"CONCATENATE('Model tables'!N68,\" (\",AE53,\"-\",AF53,\")\")","v":"204 (196-212)"},"#3525"]
[{"$nulls":13},"Pullers - barge haul",{"$nulls":15},{"$f":"'Model tables'!J69","v":"TCAE-V-6"},{"$f":"'Model tables'!H69","v":249},{"$f":"'Model tables'!I69","v":295},{"$f":"'Model tables'!L69","v":30},{"$f":"'Model tables'!M69","v":225},{"$f":"CONCATENATE('Model tables'!N69,\" (\",AE54,\"-\",AF54,\")\")","v":"272 (249-295)"},"#3525"]
[{"$nulls":13},"Rubber plant - calendars",{"$nulls":15},{"$f":"'Model tables'!J70","v":"TCAE-V-7"},{"$f":"'Model tables'!H70","v":279},{"$f":"'Model tables'!I70","v":341},{"$f":"'Model tables'!L70","v":39},{"$f":"'Model tables'!M70","v":250},{"$f":"CONCATENATE('Model tables'!N70,\" (\",AE55,\"-\",AF55,\")\")","v":"310 (279-341)"},"-"]
[{"$nulls":13},"Rubber plant - sheeter",{"$nulls":15},{"$f":"'Model tables'!J71","v":"TCAE-V-8"},{"$f":"'Model tables'!H71","v":362},{"$f":"'Model tables'!I71","v":414},{"$f":"'Model tables'!L71","v":50},{"$f":"'Model tables'!M71","v":300},{"$f":"CONCATENATE('Model tables'!N71,\" (\",AE56,\"-\",AF56,\")\")","v":"388 (362-414)"}]
[{"$nulls":13},"Rubber plant - tuber/straightener ",{"$nulls":15},{"$f":"'Model tables'!J72","v":"TCAE-V-9"},{"$f":"'Model tables'!H72","v":377},{"$f":"'Model tables'!I72","v":455},{"$f":"'Model tables'!L72","v":74},{"$f":"'Model tables'!M72","v":350},{"$f":"CONCATENATE('Model tables'!N72,\" (\",AE57,\"-\",AF57,\")\")","v":"416 (377-455)"}]
[{"$nulls":13},"Timber - Barker (drum)",{"$nulls":15},{"$f":"'Model tables'!J73","v":"TCAE-V-10"},{"$f":"'Model tables'!H73","v":423},{"$f":"'Model tables'!I73","v":509},{"$f":"'Model tables'!L73","v":103},{"$f":"'Model tables'!M73","v":390},{"$f":"CONCATENATE('Model tables'!N73,\" (\",AE58,\"-\",AF58,\")\")","v":"466 (423-509)"}]
[{"$nulls":29},{"$f":"'Model tables'!J74","v":"TCAE-V-11"},{"$f":"'Model tables'!H74","v":455},{"$f":"'Model tables'!I74","v":549},{"$f":"'Model tables'!L74","v":137},{"$f":"'Model tables'!M74","v":440},{"$f":"CONCATENATE('Model tables'!N74,\" (\",AE59,\"-\",AF59,\")\")","v":"502 (455-549)"}]
[{"$nulls":29},{"$f":"'Model tables'!J75","v":"TCAE-V-12"},{"$f":"'Model tables'!H75","v":476},{"$f":"'Model tables'!I75","v":580},{"$f":"'Model tables'!L75","v":181},{"$f":"'Model tables'!M75","v":490},{"$f":"CONCATENATE('Model tables'!N75,\" (\",AE60,\"-\",AF60,\")\")","v":"528 (476-580)"}]
[{"$nulls":29},{"$f":"'Model tables'!J76","v":"TCAE-V-13"},{"$f":"'Model tables'!H76","v":506},{"$f":"'Model tables'!I76","v":610},{"$f":"'Model tables'!L76","v":226},{"$f":"'Model tables'!M76","v":550},{"$f":"CONCATENATE('Model tables'!N76,\" (\",AE61,\"-\",AF61,\")\")","v":"558 (506-610)"}]
[{"$nulls":29},{"$f":"'Model tables'!J77","v":"TCAE-V-14"},{"$f":"'Model tables'!H77","v":551},{"$f":"'Model tables'!I77","v":665},{"$f":"'Model tables'!L77","v":274},{"$f":"'Model tables'!M77","v":625},{"$f":"CONCATENATE('Model tables'!N77,\" (\",AE62,\"-\",AF62,\")\")","v":"608 (551-665)"}]

{"sheet":"Model tables","index":1,"n_rows":136,"n_cols":36,"rows_kept":136,"hidden":true,"merged":[[1,23,1,35],[3,25,3,26],[3,29,3,30],[3,33,3,34],[7,6,8,6],[7,7,7,8],[7,9,8,9],[7,10,8,10],[7,20,8,20],[8,25,8,26],[9,0,9,1],[10,0,10,1],[11,0,11,1],[12,0,12,1],[13,25,13,26],[15,5,17,5],[18,25,18,26],[19,11,19,12],[23,6,23,7],[23,25,23,26],[24,31,24,32],[33,6,34,6],[33,8,34,8],[33,9,34,9],[33,20,34,20],[59,6,60,6],[59,7,59,8],[59,9,60,9],[59,10,60,10],[59,20,60,20],[81,6,81,7],[90,6,91,6],[90,7,90,8],[90,9,91,9],[90,10,91,10],[90,18,91,18],[106,6,106,7],[116,6,117,6],[116,7,116,8],[116,9,117,9],[116,10,117,10],[129,6,129,7]]}
["Model tables"]
["speed",{"$f":"Gearspeed","v":0},null,null,"Max service life",6,"yrs",{"$nulls":16},"FINAL SELECTION"]
[null,"years","hours","months"]
["service life period",{"v":1,"d":"1.0"},{"$f":"+hourpa*B4","v":0},{"$f":"B4*12","v":12},{"$nulls":20},"Arg 1",{"$f":"+IF(Y5=1,\"S Series Required\",\"-\")","v":"S Series Required"},{"$nulls":3},"check S series against life",{"$nulls":3},"check S series against shaft diam",null,"TCAE"]
["service life period",{"v":2,"d":"2.0"},{"$f":"+hourpa*B5","v":0},{"$f":"B5*12","v":24},{"$nulls":19},"\"S\" series",{"$f":"+IF(H30<>1,+IF(H56=1,1,0),0)","v":1},"Selected"]
["service life period",{"v":3,"d":"3.0"},{"$f":"+hourpa*B6","v":0},{"$f":"B6*12","v":36},{"$nulls":22},{"$f":"+IF(Y5=1,+IF(P33<=H36,G36,+IF(P33<=H37,G37,+IF(P33<=H38,G38,+IF(P33<=H39,G39,+IF(P33<=H40,G40,+IF(P33<=H41,G41,+IF(P33<=H42,G42,+IF(P33<=H43,G43,+IF(P33<=H44,G44,+IF(P33<=H45,G45,+IF(P33<=H46,G46,+IF(P33<=H47,G47,+IF(P33<=H48,G48,+IF(P33<=H49,G49,G50)))))))))))))))","v":"DOJ100"},"IDEAL",{"$f":"+VLOOKUP(AA6,G36:J49,4)","v":{"$error":"#DIV/0!"}},{"$f":"+IF(AC6<C5,\"Larger model required\",\"OK\")","v":{"$error":"#DIV/0!"}},null,{"$f":"+IF(AD6<>\"OK\",G52,AA6)","v":{"$error":"#DIV/0!"}},"IDEAL",{"$f":"+VLOOKUP(AF6,G36:J49,4)","v":{"$error":"#DIV/0!"}},{"$f":"+IF(+VLOOKUP(AF6,G36:H49,2)>=P33,\"OK\",\"check shaft diameter\")","v":{"$error":"#DIV/0!"}},{"$f":"+VLOOKUP(AF6,G36:I49,3)","v":{"$error":"#DIV/0!"}}]
[{"$nulls":6},"R-Series"]
["Determine final selection based on shaft details",{"$nulls":5},"Model","D.B.S.E. ",null,"TCAE MODEL","LIFE hrs","weight","Dia","D.B.S.E. ","expansion","DBSE","Life Option1 ","Life Option2","Life Option3","Speed","Max rpm"]
["Given from data entry",{"$nulls":6},"min","max",null,null,"kg","mm","nom","+/- mm","Check","Check","Check","Check","Check",{"$nulls":4},"Arg 2",{"$f":"+IF(Y10=1,\"R series Required\",\"-\")","v":"-"}]
["motor shaft diameter",null,{"$f":"+DriveShaftdia.","v":0},"mm",null,null,"BC75 - R",82,90,"TCAE-0-R",{"$f":"+Formulae!C12","v":{"$error":"#DIV/0!"}},{"v":3.9,"d":"4"},117,{"$nulls":10},"\"R\" series",{"$f":"+IF(H30=1,1,0)","v":0},"Selected",{"$f":"+IF(Y10=1,+VLOOKUP(G21,G12:J20,4))","v":false},"LESSER"]
["driven shaft diameter",null,{"$f":"+DrivenShaftdia.","v":0},"mm",null,null,"BC87 - R",94,110,"TCAE-0E-R",{"$f":"+Formulae!C13","v":{"$error":"#DIV/0!"}},5,134,{"$nulls":13},{"$f":"+IF(Y10=1,+VLOOKUP(G22,G12:J20,4))","v":false},"IDEAL"]
["gearbox shaft diameter",null,{"$f":"+gearshaftdia","v":0},"mm",null,null,"BJ095 - R",130,140,"TCAE-R-1",{"$f":"+Formulae!C19","v":{"$error":"#DIV/0!"}},{"$f":"9.1-(3.6*2)","v":{"v":1.8999999999999995,"d":"1.9"}},148,{"$f":"H12+O12","v":135},{"$f":"(I12-H12)/2","v":5},{"$f":"+IF(AND($C$13>=H12,$C$13<=I12),1,0)","v":0},{"$f":"IF(AND(K12>$C$4,K12<$C$5),1,0)","v":{"$error":"#DIV/0!"}},{"$f":"IF(AND(K12>$C$5,K12<$C$6),1,0)","v":{"$error":"#DIV/0!"}},{"$f":"IF(K12>=$C$6,1,0)","v":{"$error":"#DIV/0!"}},{"$f":"IF($B$2<=U12,1,0)","v":1},{"$f":"'Daves pad 6 (Shikar mod)'!R6","v":3600},{"$nulls":5},{"$f":"+IF(Y10=1,+VLOOKUP(G23,G12:J20,4))","v":false},"GREATER"]
["DBSE",null,{"$f":"+DBSE.","v":0},"mm",null,null,"BJ125 - R",155,175,"TCAE-R-2",{"$f":"+Formulae!C20","v":{"$error":"#DIV/0!"}},{"$f":"14.7-(2.4*2)","v":{"v":9.899999999999999,"d":"9.9"}},178,{"$f":"H13+O13","v":165},{"$f":"(I13-H13)/2","v":10},{"$f":"+IF(AND($C$13>=H13,$C$13<=I13),1,0)","v":0},{"$f":"IF(AND(K13>$C$4,K13<$C$5),1,0)","v":{"$error":"#DIV/0!"}},{"$f":"IF(AND(K13>$C$5,K13<$C$6),1,0)","v":{"$error":"#DIV/0!"}},{"$f":"IF(K13>=$C$6,1,0)","v":{"$error":"#DIV/0!"}},{"$f":"IF($B$2<=U13,1,0)","v":1},{"$f":"'Daves pad 6 (Shikar mod)'!R7","v":3600}]
[{"$nulls":6},"BJ150 - R",285,305,"TCAE-R-3",{"$f":"+Formulae!C21","v":{"$error":"#DIV/0!"}},{"$f":"31.5-(5.5*2)","v":20.5},215,295,10,{"$f":"+IF(AND($C$13>=H14,$C$13<=I14),1,0)","v":0},{"$f":"IF(AND(K14>$C$4,K14<$C$5),1,0)","v":{"$error":"#DIV/0!"}},{"$f":"IF(AND(K14>$C$5,K14<$C$6),1,0)","v":{"$error":"#DIV/0!"}},{"$f":"IF(K14>=$C$6,1,0)","v":{"$error":"#DIV/0!"}},1,{"$f":"'Daves pad 6 (Shikar mod)'!R8","v":3000},{"$nulls":3},"Arg 3",{"$f":"+IF(Y15=1,\"L series Required\",\"-\")","v":"-"}]
["Selection based on DBSE, service life, speed",{"$nulls":5},"BJ175 - R",285,305,"TCAE-R-4",{"$f":"+Formulae!C22","v":{"$error":"#DIV/0!"}},{"$f":"45.5-(8.6*2)","v":28.3},253,295,{"$f":"(I15-H15)/2","v":10},0,{"$error":"#DIV/0!"},{"$error":"#DIV/0!"},{"$error":"#DIV/0!"},1,{"$f":"'Daves pad 6 (Shikar mod)'!R9","v":3000},null,null,"\"L\" series",{"$f":"+IF(H113=1,1,0)","v":0},"Selected",{"$f":"+IF(Y15=1,+VLOOKUP(G104,G95:J102,4))","v":false},"LESSER"]
["(1 - 2 years)",null,{"$f":"IFERROR(INDEX(Q8:Q129,MATCH(D16,S8:S129,0)),\"-\")","v":"-"},{"$f":"IFERROR(IF(OR(S21<>\"-\",S51<>\"-\",S79<>\"-\",S104<>\"-\",S127<>\"-\"),MAX(S21,S51,S79,S104,S127),\"-\"),\"-\")","v":"-"},{"$f":"IFERROR(INDEX(T8:T129,MATCH(D16,S8:S129,0)),\"-\")","v":"-"},"Preferred selection (satisfies all requirements)","BJ200 - R",300,330,"TCAE-R-5",{"$f":"+Formulae!C23","v":{"$error":"#DIV/0!"}},{"$f":"58.2-(9.8*2)","v":38.6},278,315,15,0,{"$error":"#DIV/0!"},{"$error":"#DIV/0!"},{"$error":"#DIV/0!"},1,{"$f":"'Daves pad 6 (Shikar mod)'!R10","v":3000},{"$nulls":5},{"$f":"+IF(Y15=1,+VLOOKUP(G105,G95:J102,4))","v":false},"IDEAL"]
["(2 - 3 years)",null,{"$f":"IFERROR(INDEX(Q8:Q129,MATCH(D17,S8:S129,0)),\"-\")","v":"-"},{"$f":"IFERROR(IF(OR(S22<>\"-\",S52<>\"-\",S80<>\"-\",S105<>\"-\",S128<>\"-\"),MAX(S22,S52,S80,S105,S128),\"-\"),\"-\")","v":"-"},{"$f":"IFERROR(INDEX(T8:T129,MATCH(D17,S8:S129,0)),\"-\")","v":"-"},null,"BJ225 - R",277,305,"TCAE-R-6",{"$f":"+Formulae!C24","v":{"$error":"#DIV/0!"}},{"$f":"74-(15.33*2)","v":{"v":43.34,"d":"43.3"}},300,291,14,0,{"$error":"#DIV/0!"},{"$error":"#DIV/0!"},{"$error":"#DIV/0!"},1,{"$f":"'Daves pad 6 (Shikar mod)'!R11","v":2700},{"$nulls":5},{"$f":"+IF(Y15=1,+VLOOKUP(G106,G95:J102,4))","v":false},"GREATER"]
["( > 3 years)",null,{"$f":"IFERROR(INDEX(Q8:Q129,MATCH(D18,S8:S129,0)),\"-\")","v":"-"},{"$f":"IFERROR(IF(OR(S23<>\"-\",S53<>\"-\",S81<>\"-\",S106<>\"-\",S129<>\"-\"),MIN(S23,S53,S81,S106,S129),\"-\"),\"-\")","v":"-"},{"$f":"IFERROR(INDEX(T8:T129,MATCH(D18,S8:S129,0)),\"-\")","v":"-"},null,"BJ250 - R",330,358,"TCAE-R-7",{"$f":"+Formulae!C25","v":{"$error":"#DIV/0!"}},{"$f":"103-(21.6*2)","v":59.8},330,344,14,0,{"$error":"#DIV/0!"},{"$error":"#DIV/0!"},{"$error":"#DIV/0!"},1,{"$f":"'Daves pad 6 (Shikar mod)'!R12","v":2300}]
[{"$nulls":6},"BJ300 - R",330,358,"TCAE-R-8",{"$f":"+Formulae!C26","v":{"$error":"#DIV/0!"}},{"$f":"116-(26.83*2)","v":{"v":62.34,"d":"62.3"}},370,344,{"$f":"(I19-H19)/2","v":14},0,{"$error":"#DIV/0!"},{"$error":"#DIV/0!"},{"$error":"#DIV/0!"},1,{"$f":"'Daves pad 6 (Shikar mod)'!R13","v":2000},{"$nulls":3},"Arg 4",{"$f":"+IF(Y20=1,\"CM series Required\",\"-\")","v":"-"}]
["Additonal selection based on service life, speed",{"$nulls":10},"life & speed check",{"$nulls":11},"\"CM\" series",{"$f":"+IF(H136=1,1,0)","v":0},"Selected",{"$f":"+IF(Y20=1,+VLOOKUP(G127,G119:J124,4))","v":false},"LESSER"]
["(1 - 2 years)",null,{"$f":"IFERROR(INDEX(G12:G129,MATCH(D21,I12:I129,0)),\"-\")","v":"-"},{"$f":"IF(H30<>\"-\",IF(L21=$B$4,I21,IF(L22=$B$4,I22,IF(L23=$B$4,I23,IF(L104=$B$4,I104,IF(L105=$B$4,I105,IF(L106=$B$4,I106,IF(L127=$B$4,I127,IF(L128=$B$4,I128,IF(L129=$B$4,I129,IF(AND(L21=$B$4,L22=$B$4,L23=$B$4,L79=$B$4,L80=$B$4,L81=$B$4,L104=$B$4,L105=$B$4,L106=$B$4,L127=$B$4,L128=$B$4,L129=$B$4),MAX(I21,I22,I23,I79,I80,I81,I104,I105,I106,I127,I128,I129),\"-\")))))))))),\"-\")","v":"-"},{"$f":"IFERROR(INDEX(M8:M129,MATCH(D21,I8:I129,0)),\"-\")","v":"-"},null,{"$f":"IF(G22=J12,J12,INDEX(J12:J19,MATCH(G22,J12:J19,0)-1,1))","v":{"$error":"#DIV/0!"}},"LESSER",{"$f":"IFERROR(+VLOOKUP(G21,J12:K19,2,FALSE)/hourpa,0)","v":{"v":0,"d":"0.0"}},{"$f":"IFERROR(INDEX(H12:H19,MATCH(G21,J12:J19,0)),\"-\")","v":"-"},{"$f":"IFERROR(INDEX(I12:I19,MATCH(G21,J12:J19,0)),\"-\")","v":"-"},{"$f":"IF(I21<$B$4,0,IF(AND(I21>=$B$4,I21<$B$5,$B$2<=M21),$B$4,IF(AND(I21>=$B$5,I21<$B$6,$B$2<=M21),$B$5,IF(AND(I21>=$B$6,I21<=$F$2,$B$2<=M21),$B$6,0))))","v":0},{"$f":"IFERROR(INDEX(U12:U19,MATCH(G21,J12:J19,0)),\"-\")","v":"-"},{"$nulls":3},{"$f":"IF(AND(P12=1,Q12=1,T12=1),J12,IF(AND(P13=1,Q13=1,T13=1),J13,IF(AND(P14=1,Q14=1,T14=1),J14,IF(AND(P15=1,Q15=1,T15=1),J15,IF(AND(P16=1,Q16=1,T16=1),J16,IF(AND(P17=1,Q17=1,T17=1),J17,IF(AND(P18=1,Q18=1,T18=1),J18,IF(AND(P19=1,Q19=1,T19=1),J19,\"-\"))))))))","v":{"$error":"#DIV/0!"}},"OPTION1",{"$f":"IFERROR(+VLOOKUP(Q21,J12:K19,2,FALSE)/hourpa,\"-\")","v":"-"},{"$f":"IFERROR(INDEX(U12:U19,MATCH(Q21,J12:J19,0)),\"-\")","v":"-"},{"$nulls":6},{"$f":"+IF(Y20=1,+VLOOKUP(G128,G119:J124,4))","v":false},"IDEAL"]
["(1 - 2 years)...V-series only",null,{"$f":"IFERROR(INDEX(G12:G129,MATCH(D22,I12:I129,0)),\"-\")","v":"-"},{"$f":"IF(H87<>\"-\",IF(L79=$B$4,I79,IF(L80=$B$4,I80,IF(L81=$B$4,I81,\"-\"))),\"-\")","v":"-"},{"$f":"IFERROR(INDEX(M8:M129,MATCH(D22,I8:I129,0)),\"-\")","v":"-"},null,{"$f":"+IF(C5<'Model tables'!K12,'Model tables'!J12,+IF(C5<'Model tables'!K13,'Model tables'!J13,+IF(C5<'Model tables'!K14,'Model tables'!J14,+IF(C5<'Model tables'!K15,'Model tables'!J15,+IF(C5<'Model tables'!K16,'Model tables'!J16,+IF(C5<'Model tables'!K17,'Model tables'!J17,+IF(C5<'Model tables'!K18,'Model tables'!J18,+IF(C5<'Model tables'!K19,'Model tables'!J19,\"-\"))))))))","v":{"$error":"#DIV/0!"}},"IDEAL",{"$f":"IFERROR(+VLOOKUP(G22,J12:K19,2,FALSE)/hourpa,0)","v":{"v":0,"d":"0.0"}},{"$f":"IFERROR(INDEX(H12:H19,MATCH(G22,J12:J19,0)),\"-\")","v":"-"},{"$f":"IFERROR(INDEX(I12:I19,MATCH(G22,J12:J19,0)),\"-\")","v":"-"},{"$f":"IF(I22<$B$4,0,IF(AND(I22>=$B$4,I22<$B$5,$B$2<=M22),$B$4,IF(AND(I22>=$B$5,I22<$B$6,$B$2<=M22),$B$5,IF(AND(I22>=$B$6,I22<=$F$2,$B$2<=M22),$B$6,0))))","v":0},{"$f":"IFERROR(INDEX(U12:U19,MATCH(G22,J12:J19,0)),\"-\")","v":"-"},{"$nulls":3},{"$f":"IF(AND(P12=1,R12=1,T12=1),J12,IF(AND(P13=1,R13=1,T13=1),J13,IF(AND(P14=1,R14=1,T14=1),J14,IF(AND(P15=1,R15=1,T15=1),J15,IF(AND(P16=1,R16=1,T16=1),J16,IF(AND(P17=1,R17=1,T17=1),J17,IF(AND(P18=1,R18=1,T18=1),J18,IF(AND(P19=1,R19=1,T19=1),J19,\"-\"))))))))","v":{"$error":"#DIV/0!"}},"OPTION2",{"$f":"IFERROR(+VLOOKUP(Q22,J12:K19,2,FALSE)/hourpa,\"-\")","v":"-"},{"$f":"IFERROR(INDEX(U12:U19,MATCH(Q22,J12:J19,0)),\"-\")","v":"-"},{"$nulls":6},{"$f":"+IF(Y20=1,+VLOOKUP(G129,G119:J124,4))","v":false},"GREATER"]
["(2 - 3 years)",null,{"$f":"IFERROR(INDEX(G12:G129,MATCH(D23,I12:I129,0)),\"-\")","v":"-"},{"$f":"IF(H30<>\"-\",IF(L21=$B$5,I21,IF(L22=$B$5,I22,IF(L23=$B$5,I23,IF(L104=$B$5,I104,IF(L105=$B$5,I105,IF(L106=$B$5,I106,IF(L127=$B$5,I127,IF(L128=$B$5,I128,IF(L129=$B$5,I129,IF(AND(L21=$B$5,L22=$B$5,L23=$B$5,L79=$B$5,L80=$B$5,L81=$B$5,L104=$B$5,L105=$B$5,L106=$B$5,L127=$B$5,L128=$B$5,L129=$B$5),MAX(I21,I22,I23,I79,I80,I81,I104,I105,I106,I127,I128,I129),\"-\")))))))))),\"-\")","v":"-"},{"$f":"IFERROR(INDEX(M8:M129,MATCH(D23,I8:I129,0)),\"-\")","v":"-"},null,{"$f":"IF(G22=J19,J19,INDEX(J12:J19,MATCH(G22,J12:J19,0)+1,1))","v":{"$error":"#DIV/0!"}},"GREATER",{"$f":"IFERROR(+VLOOKUP(G23,J12:K19,2,FALSE)/hourpa, 0)","v":{"v":0,"d":"0.0"}},{"$f":"IFERROR(INDEX(H12:H19,MATCH(G23,J12:J19,0)),\"-\")","v":"-"},{"$f":"IFERROR(INDEX(I12:I19,MATCH(G23,J12:J19,0)),\"-\")","v":"-"},{"$f":"IF(I23<$B$4,0,IF(AND(I23>=$B$4,I23<$B$5,$B$2<=M23),$B$4,IF(AND(I23>=$B$5,I23<$B$6,$B$2<=M23),$B$5,IF(AND(I23>=$B$6,I23<=$F$2,$B$2<=M23),$B$6,0))))","v":0},{"$f":"IFERROR(INDEX(U12:U19,MATCH(G23,J12:J19,0)),\"-\")","v":"-"},{"$nulls":3},{"$f":"IF(AND(P12=1,S12=1,T12=1),J12,IF(AND(P13=1,S13=1,T13=1),J13,IF(AND(P14=1,S14=1,T14=1),J14,IF(AND(P15=1,S15=1,T15=1),J15,IF(AND(P16=1,S16=1,T16=1),J16,IF(AND(P17=1,S17=1,T17=1),J17,IF(AND(P18=1,S18=1,T18=1),J18,IF(AND(P19=1,S19=1,T19=1),J19,\"-\"))))))))","v":{"$error":"#DIV/0!"}},"OPTION3",{"$f":"IFERROR(+VLOOKUP(Q23,J12:K19,2,FALSE)/hourpa,\"-\")","v":"-"},{"$f":"IFERROR(INDEX(U12:U19,MATCH(Q23,J12:J19,0)),\"-\")","v":"-"}]
["(2 - 3 years)...V-series only",null,{"$f":"IFERROR(INDEX(G12:G129,MATCH(D24,I12:I129,0)),\"-\")","v":"-"},{"$f":"IF(H87<>\"-\",IF(L79=$B$5,I79,IF(L80=$B$5,I80,IF(L81=$B$5,I81,\"-\"))),\"-\")","v":"-"},{"$f":"IFERROR(INDEX(M8:M129,MATCH(D24,I8:I129,0)),\"-\")","v":"-"},null,"DBSE",{"$nulls":17},"Arg 5",{"$f":"+IF(Y25=1,\"E series Required\",\"-\")","v":{"$error":"#REF!"}}]
["( > 3 years)",null,{"$f":"IFERROR(INDEX(G12:G129,MATCH(D25,I12:I129,0)),\"-\")","v":"-"},{"$f":"IF(H30<>\"-\",IF(L21=$B$6,I21,IF(L22=$B$6,I22,IF(L23=$B$6,I23,IF(L104=$B$6,I104,IF(L105=$B$6,I105,IF(L106=$B$6,I106,IF(L127=$B$6,I127,IF(L128=$B$6,I128,IF(L129=$B$6,I129,IF(AND(L21=$B$6,L22=$B$6,L23=$B$6,L79=$B$6,L80=$B$6,L81=$B$6,L104=$B$6,L105=$B$6,L106=$B$6,L127=$B$6,L128=$B$6,L129=$B$6),MIN(I21,I22,I23,I79,I80,I81,I104,I105,I106,I127,I128,I129),\"-\")))))))))),\"-\")","v":"-"},{"$f":"IFERROR(INDEX(M8:M129,MATCH(D25,I8:I129,0)),\"-\")","v":"-"},null,"min","max",{"$nulls":15},"\"E\" series",{"$f":"+IF(AND(H87=1,#REF!=1),1,0)","v":{"$error":"#REF!"}},"Selected",{"$f":"+IF(Y25=1,+VLOOKUP(G79,G62:J77,4))","v":{"$error":"#REF!"}},"LESSER",{"$nulls":3},{"$f":"+IF(AE26=1,\"E series Required\",\"-\")","v":{"$error":"#REF!"}},null,"check E series against life and DBSE"]
["( > 3 years)...V-series only",null,{"$f":"IFERROR(INDEX(G12:G129,MATCH(D26,I12:I129,0)),\"-\")","v":"-"},{"$f":"IF(H87<>\"-\",IF(L79=$B$6,I79,IF(L80=$B$6,I80,IF(L81=$B$6,I81,\"-\"))),\"-\")","v":"-"},{"$f":"IFERROR(INDEX(M8:M129,MATCH(D26,I8:I129,0)),\"-\")","v":"-"},null,{"$f":"IFERROR(INDEX(H12:H19,MATCH(G22,J12:J19,0)),\"-\")","v":"-"},{"$f":"IFERROR(INDEX(I12:I19,MATCH(G22,J12:J19,0)),\"-\")","v":"-"},{"$nulls":18},{"$f":"+IF(Y25=1,+VLOOKUP(G80,G62:J77,4))","v":{"$error":"#REF!"}},"IDEAL",null,null,{"$f":"+IF(#REF!=1,1,0)","v":{"$error":"#REF!"}},null,"IDEAL",{"$f":"+VLOOKUP(AF26,J62:K77,2,FALSE)","v":{"$error":"#N/A"}}]
[{"$nulls":26},{"$f":"+IF(Y25=1,+VLOOKUP(G81,G62:J77,4))","v":{"$error":"#REF!"}},"GREATER"]
["Final Selection"]
["OPTION 1 (1 - 2 years)",null,{"$f":"IFERROR(INDEX(C16:C26,MATCH(D29,D16:D26,0)),\"-\")","v":"-"},{"$f":"IF(AND(D16<>0,D16<>\"-\"),D16,IF(AND(D17<>0,D17<>\"-\"),D17,IF(AND(D18<>0,D18<$F$2),D18,\"-\")))","v":"-"},{"$nulls":3},"Arg 2"]
["OPTION 2",null,{"$f":"IFERROR(INDEX(C16:C26,MATCH(D30,D16:D26,0)),\"-\")","v":"-"},{"$f":"IF(AND(D16<>0,D16<>\"-\",D16<>D29),D16,IF(AND(D21<>\"-\",D21<>D16,D21<>D17),D21,IF(AND(D22<>\"-\",D22<>D16,D22<>D17),D22,IF(AND(D23<>\"-\",D23<>D16,D23<>D17),D23,IF(AND(D24<>\"-\",D24<>D16,D24<>D17),D24,MIN(D25,D26))))))","v":{"v":0,"d":"0.0"}},null,null,"R-Series",{"$f":"+IFERROR(IF(AND($C$13>=(G26-200), $C$13<=(H26+200)),1,\"-\"),\"-\")","v":"-"}]
["OPTION 3",null,{"$f":"IFERROR(INDEX(C16:C26,MATCH(D31,D16:D26,0)),\"-\")","v":"-"},{"$f":"IF(AND(D18<>0,D29<>D18,D18<>\"-\",D18<$F$2),D18,IF(AND(D23<>\"-\",D23<>D17,D23<>D18,D30<>D23),D23,IF(AND(D25<>\"-\",D25<>D17,D25<>D18),D25,IF(D30<>D26,MIN(D24,D26),\"-\"))))","v":{"v":0,"d":"0.0"}}]
[{"$nulls":15}," max shaft  dia"]
[{"$nulls":6},"S-Series","Note: design based on DOJ series. BCF series used for torque value because of bore and keysize",{"$nulls":7},{"$f":"+MAX(C10:C12)","v":0}]
[{"$nulls":6},"Model","BORE Dia","TCAE MODEL","LIFE hrs","weight","Dia","min D.B.S.E.","max D.B.S.E.","nom D.B.S.E","DBSE & Bore","Life Option1 ","Life Option2","Life Option3","Speed","Max rpm"]
[{"$nulls":7},"max ",null,null,"kg","mm","mm","mm","mm","Check","Check","Check","Check","Check"]
[{"$nulls":6},"DOJ100",30,{"$f":"IF(AND($C$13>=M36,$C$13<=N36),\"TCAE-S-1\",\"TCAE-S-1 + Spacer\")","v":"TCAE-S-1 + Spacer"},{"$f":"Formulae!C60","v":{"$error":"#DIV/0!"}},{"v":4.8,"d":"5"},152,10,30,{"$f":"(N36-M36)/2","v":10},{"$f":"+IF(AND($C$13>=M36,$C$13<$G$26,$P$33<=H36,$C$13<$H$119),1,0)","v":0},{"$f":"IF(AND(J36>$C$4,J36<$C$5),1,0)","v":{"$error":"#DIV/0!"}},{"$f":"IF(AND(J36>$C$5,J36<$C$6),1,0)","v":{"$error":"#DIV/0!"}},{"$f":"IF(J36>=$C$6,1,0)","v":{"$error":"#DIV/0!"}},{"$f":"IF($B$2<=U36,1,0)","v":1},{"$f":"'Daves pad 6 (Shikar mod)'!R37","v":3000}]
[{"$nulls":6},"DOJ125",40,{"$f":"IF(AND($C$13>=M37,$C$13<=N37),\"TCAE-S-2\",\"TCAE-S-2 + Spacer\")","v":"TCAE-S-2 + Spacer"},{"$f":"Formulae!C61","v":{"$error":"#DIV/0!"}},{"v":8.52,"d":"9"},179,10,30,{"$f":"(N37-M37)/2","v":10},{"$f":"+IF(AND($C$13>=M37,$C$13<$G$26,$P$33<=H37,$C$13<$H$119),1,0)","v":0},{"$f":"IF(AND(J37>$C$4,J37<$C$5),1,0)","v":{"$error":"#DIV/0!"}},{"$f":"IF(AND(J37>$C$5,J37<$C$6),1,0)","v":{"$error":"#DIV/0!"}},{"$f":"IF(J37>=$C$6,1,0)","v":{"$error":"#DIV/0!"}},{"$f":"IF($B$2<=U37,1,0)","v":1},{"$f":"'Daves pad 6 (Shikar mod)'!R38","v":3000}]
[{"$nulls":6},"DOJ150",50,{"$f":"IF(AND($C$13>=M38,$C$13<=N38),\"TCAE-S-3\",\"TCAE-S-3 + Spacer\")","v":"TCAE-S-3 + Spacer"},{"$f":"Formulae!C62","v":{"$error":"#VALUE!"}},{"v":14.7,"d":"15"},215,10,30,10,0,{"$error":"#VALUE!"},{"$f":"IF(AND(J38>$C$5,J38<$C$6),1,0)","v":{"$error":"#VALUE!"}},{"$error":"#VALUE!"},1,{"$f":"'Daves pad 6 (Shikar mod)'!R39","v":2500}]
[{"$nulls":6},"DOJ175",{"$f":"Formulae!D63","v":55},{"$f":"IF(AND($C$13>=M39,$C$13<=N39),\"TCAE-S-4\",\"TCAE-S-4 + Spacer\")","v":"TCAE-S-4 + Spacer"},{"$f":"Formulae!C63","v":{"$error":"#DIV/0!"}},18,236,10,30,{"$f":"(N39-M39)/2","v":10},0,{"$error":"#DIV/0!"},{"$error":"#DIV/0!"},{"$error":"#DIV/0!"},1,{"$f":"'Daves pad 6 (Shikar mod)'!R40","v":2500}]
[{"$nulls":6},"DOJ200",{"$f":"Formulae!D64","v":60},{"$f":"IF(AND($C$13>=M40,$C$13<=N40),\"TCAE-S-5\",\"TCAE-S-5 + Spacer\")","v":"TCAE-S-5 + Spacer"},{"$f":"Formulae!C64","v":{"$error":"#DIV/0!"}},{"v":33.2,"d":"33"},270,10,30,{"$f":"(N40-M40)/2","v":10},0,{"$error":"#DIV/0!"},{"$error":"#DIV/0!"},{"$error":"#DIV/0!"},1,{"$f":"'Daves pad 6 (Shikar mod)'!R41","v":2500}]
[{"$nulls":6},"DOJ225",{"$f":"Formulae!D65","v":65},{"$f":"IF(AND($C$13>=M41,$C$13<=N41),\"TCAE-S-6\",\"TCAE-S-6 + Spacer\")","v":"TCAE-S-6 + Spacer"},{"$f":"Formulae!C65","v":{"$error":"#DIV/0!"}},{"v":27.85,"d":"28"},244,10,30,10,0,{"$error":"#DIV/0!"},{"$error":"#DIV/0!"},{"$error":"#DIV/0!"},1,{"$f":"'Daves pad 6 (Shikar mod)'!R42","v":2200}]
[{"$nulls":6},"DOJ250",65,{"$f":"IF(AND($C$13>=M42,$C$13<=N42),\"TCAE-S-7\",\"TCAE-S-7 + Spacer\")","v":"TCAE-S-7 + Spacer"},{"$f":"Formulae!C66","v":{"$error":"#DIV/0!"}},{"v":37.3,"d":"37"},272,10,30,10,0,{"$error":"#DIV/0!"},{"$error":"#DIV/0!"},{"$error":"#DIV/0!"},1,{"$f":"'Daves pad 6 (Shikar mod)'!R43","v":2000}]
[{"$nulls":6},"DOJ300",{"$f":"Formulae!D67","v":85},{"$f":"IF(AND($C$13>=M43,$C$13<=N43),\"TCAE-S-8\",\"TCAE-S-8 + Spacer\")","v":"TCAE-S-8 + Spacer"},{"$f":"Formulae!C67","v":{"$error":"#DIV/0!"}},52,292,10,30,10,0,{"$error":"#DIV/0!"},{"$error":"#DIV/0!"},{"$error":"#DIV/0!"},1,{"$f":"'Daves pad 6 (Shikar mod)'!R44","v":1800}]
[{"$nulls":6},"DOJ350",{"$f":"Formulae!D68","v":110},{"$f":"IF(AND($C$13>=M44,$C$13<=N44),\"TCAE-S-9\",\"TCAE-S-9 + Spacer\")","v":"TCAE-S-9 + Spacer"},{"$f":"Formulae!C68","v":{"$error":"#DIV/0!"}},80,336,10,30,10,{"$f":"+IF(AND($C$13>=M44,$C$13<$G$26,$P$33<=H44,$C$13<$H$119),1,0)","v":0},{"$error":"#DIV/0!"},{"$error":"#DIV/0!"},{"$error":"#DIV/0!"},1,{"$f":"'Daves pad 6 (Shikar mod)'!R45","v":1600}]
[{"$nulls":6},"DOJ400",{"$f":"Formulae!D69","v":125},{"$f":"IF(AND($C$13>=M45,$C$13<=N45),\"TCAE-S-10\",\"TCAE-S-10 + Spacer\")","v":"TCAE-S-10 + Spacer"},{"$f":"Formulae!C69","v":{"$error":"#DIV/0!"}},{"v":113.2,"d":"113"},376,10,30,10,0,{"$error":"#DIV/0!"},{"$error":"#DIV/0!"},{"$error":"#DIV/0!"},1,{"$f":"'Daves pad 6 (Shikar mod)'!R46","v":1300}]
[{"$nulls":6},"DOJ450",{"$f":"Formulae!D70","v":130},{"$f":"IF(AND($C$13>=M46,$C$13<=N46),\"TCAE-S-11\",\"TCAE-S-11 + Spacer\")","v":"TCAE-S-11 + Spacer"},{"$f":"Formulae!C70","v":{"$error":"#DIV/0!"}},{"v":119.8,"d":"120"},420,10,30,10,0,{"$error":"#DIV/0!"},{"$error":"#DIV/0!"},{"$error":"#DIV/0!"},1,{"$f":"'Daves pad 6 (Shikar mod)'!R47","v":1200}]
[{"$nulls":6},"DOJ500",{"$f":"Formulae!D71","v":150},{"$f":"IF(AND($C$13>=M47,$C$13<=N47),\"TCAE-S-12\",\"TCAE-S-12 + Spacer\")","v":"TCAE-S-12 + Spacer"},{"$f":"Formulae!C71","v":{"$error":"#DIV/0!"}},{"v":172.9,"d":"173"},462,10,30,10,0,{"$error":"#DIV/0!"},{"$error":"#DIV/0!"},{"$error":"#DIV/0!"},1,{"$f":"'Daves pad 6 (Shikar mod)'!R48","v":1100}]
[{"$nulls":6},"DOJ550",170,{"$f":"IF(AND($C$13>=M48,$C$13<=N48),\"TCAE-S-13\",\"TCAE-S-13 + Spacer\")","v":"TCAE-S-13 + Spacer"},{"$f":"Formulae!C72","v":{"$error":"#DIV/0!"}},null,504,10,30,10,0,{"$error":"#DIV/0!"},{"$error":"#DIV/0!"},{"$error":"#DIV/0!"},1,{"$f":"'Daves pad 6 (Shikar mod)'!R49","v":1000}]
[{"$nulls":6},"DOJ625",200,{"$f":"IF(AND($C$13>=M49,$C$13<=N49),\"TCAE-S-14\",\"TCAE-S-14 + Spacer\")","v":"TCAE-S-14 + Spacer"},{"$f":"Formulae!C73","v":{"$error":"#DIV/0!"}},null,580,10,30,10,0,{"$error":"#DIV/0!"},{"$error":"#DIV/0!"},{"$error":"#DIV/0!"},1,{"$f":"'Daves pad 6 (Shikar mod)'!R50","v":800}]
[]
[{"$nulls":16},{"$f":"IF(AND(P36=1,Q36=1,T36=1),I36,IF(AND(P37=1,Q37=1,T37=1),I37,IF(AND(P38=1,Q38=1,T38=1),I38,IF(AND(P39=1,Q39=1,T39=1),I39,IF(AND(P40=1,Q40=1,T40=1),I40,IF(AND(P41=1,Q41=1,T41=1),I41,IF(AND(P42=1,Q42=1,T42=1),I42,IF(AND(P43=1,Q43=1,T43=1),I43,IF(AND(P44=1,Q44=1,T44=1),I44,IF(AND(P45=1,Q45=1,T45=1),I45,IF(AND(P46=1,Q46=1,T46=1),I46,IF(AND(P47=1,Q47=1,T47=1),I47,IF(AND(P48=1,Q48=1,T48=1),I48,IF(AND(P49=1,Q49=1,T49=1),I49,\"-\"))))))))))))))","v":{"$error":"#DIV/0!"}},"OPTION1",{"$f":"IFERROR(+VLOOKUP(Q51,I36:J49,2,FALSE)/hourpa,\"-\")","v":"-"},{"$f":"IFERROR(INDEX(U36:U49,MATCH(Q51,I36:I49,0)),\"-\")","v":"-"}]
[{"$nulls":6},{"$f":"+IF(C5<'Model tables'!J36,'Model tables'!I36,+IF(C5<'Model tables'!J37,'Model tables'!I37,+IF(C5<'Model tables'!J38,'Model tables'!I38,+IF(C5<'Model tables'!J39,'Model tables'!I39,+IF(C5<'Model tables'!J40,'Model tables'!I40,+IF(C5<'Model tables'!J41,'Model tables'!I41,+IF(C5<'Model tables'!J42,'Model tables'!I42,+IF(C5<'Model tables'!J44,'Model tables'!I43,+IF(C5<'Model tables'!J43,'Model tables'!I44,+IF(C5<'Model tables'!J45,'Model tables'!I45,+IF(C5<'Model tables'!J46,'Model tables'!I46,+IF(C5<'Model tables'!J47,'Model tables'!I47,+IF(C5<'Model tables'!J48,'Model tables'!I48,+IF($C$5<J49,I49,\"-\"))))))))))))))","v":{"$error":"#DIV/0!"}},"IDEAL",{"$f":"IFERROR(+VLOOKUP(G52,I36:J49,2,FALSE)/hourpa,0)","v":{"v":0,"d":"0.0"}},{"$f":"IFERROR(INDEX(H36:H49,MATCH(G52,I36:I49,0)),\"-\")","v":"-"},null,null,{"$f":"IFERROR(INDEX(U36:U49,MATCH(G52,I36:I49,0)),\"-\")","v":"-"},{"$nulls":3},{"$f":"IF(AND(P36=1,R36=1,T36=1),I36,IF(AND(P37=1,R37=1,T37=1),I37,IF(AND(P38=1,R38=1,T38=1),I38,IF(AND(P39=1,R39=1,T39=1),I39,IF(AND(P40=1,R40=1,T40=1),I40,IF(AND(P41=1,R41=1,T41=1),I41,IF(AND(P42=1,R42=1,T42=1),I42,IF(AND(P43=1,R43=1,T43=1),I43,IF(AND(P44=1,R44=1,T44=1),I44,IF(AND(P45=1,R45=1,T45=1),I45,IF(AND(P46=1,R46=1,T46=1),I46,IF(AND(P47=1,R47=1,T47=1),I47,IF(AND(P48=1,R48=1,T48=1),I48,IF(AND(P49=1,R49=1,T49=1),I49,\"-\"))))))))))))))","v":{"$error":"#DIV/0!"}},"OPTION2",{"$f":"IFERROR(+VLOOKUP(Q52,I36:J49,2,FALSE)/hourpa,\"-\")","v":"-"},{"$f":"IFERROR(INDEX(U36:U49,MATCH(Q52,I36:I49,0)),\"-\")","v":"-"}]
[{"$nulls":16},{"$f":"IF(AND(P36=1,S36=1,T36=1),I36,IF(AND(P37=1,S37=1,T37=1),I37,IF(AND(P38=1,S38=1,T38=1),I38,IF(AND(P39=1,S39=1,T39=1),I39,IF(AND(P40=1,S40=1,T40=1),I40,IF(AND(P41=1,S41=1,T41=1),I41,IF(AND(P42=1,S42=1,T42=1),I42,IF(AND(P43=1,S43=1,T43=1),I43,IF(AND(P44=1,S44=1,T44=1),I44,IF(AND(P45=1,S45=1,T45=1),I45,IF(AND(P46=1,S46=1,T46=1),I46,IF(AND(P47=1,S47=1,T47=1),I47,IF(AND(P48=1,S48=1,T48=1),I48,IF(AND(P49=1,S49=1,T49=1),I49,\"-\"))))))))))))))","v":{"$error":"#DIV/0!"}},"OPTION3",{"$f":"IFERROR(+VLOOKUP(Q53,I36:J49,2,FALSE)/hourpa,\"-\")","v":"-"},{"$f":"IFERROR(INDEX(U36:U49,MATCH(Q53,I36:I49,0)),\"-\")","v":"-"}]
[]
[{"$nulls":7},"Arg 1"]
[{"$nulls":6},"S-Series",{"$f":"+IF(AND(C13<=H12,P33<=J52),1,\"-\")","v":1}]
[]
[]
[{"$nulls":6},"V-Series"]
[{"$nulls":6},"Model","D.B.S.E. ",null,"TCAE MODEL","LIFE hrs","weight","Dia","D.B.S.E. ","expansion","DBSE","Life Option1 ","Life Option2","Life Option3","Speed","Max rpm"]
[{"$nulls":7},"min","max ",null,null,"kg","mm","nom","+/- mm","Check","Check","Check","Check","Check"]
[{"$nulls":6},"BC75P_A",74,80,"TCAE-V-00",{"$f":"Formulae!C12","v":{"$error":"#DIV/0!"}},{"v":1.9,"d":"2"},118,{"$f":"H62+O62","v":77},3,{"$f":"+IF(AND($C$13>=H62,$C$13<=I62),1,0)","v":0},{"$f":"IF(AND(K62>$C$4,K62<$C$5),1,0)","v":{"$error":"#DIV/0!"}},{"$f":"IF(AND(K62>$C$5,K62<$C$6),1,0)","v":{"$error":"#DIV/0!"}},{"$f":"IF(K62>=$C$6,1,0)","v":{"$error":"#DIV/0!"}},{"$f":"IF($B$2<=U62,1,0)","v":1},{"$f":"'Daves pad 6 (Shikar mod)'!R52","v":3000}]
[{"$nulls":6},"DOX87F",84,92,"TCAE-V-0",{"$f":"Formulae!C13","v":{"$error":"#DIV/0!"}},{"v":2.9,"d":"3"},134,{"$f":"H63+O63","v":88},4,{"$f":"+IF(AND($C$13>=H63,$C$13<=I63),1,0)","v":0},{"$f":"IF(AND(K63>$C$4,K63<$C$5),1,0)","v":{"$error":"#DIV/0!"}},{"$f":"IF(AND(K63>$C$5,K63<$C$6),1,0)","v":{"$error":"#DIV/0!"}},{"$f":"IF(K63>=$C$6,1,0)","v":{"$error":"#DIV/0!"}},{"$f":"IF($B$2<=U63,1,0)","v":1},{"$f":"'Daves pad 6 (Shikar mod)'!R53","v":2000}]
[{"$nulls":6},"DOX100F",96,108,"TCAE-V-1",{"$f":"Formulae!C14","v":{"$error":"#DIV/0!"}},{"v":4.4,"d":"4"},152,102,6,0,{"$error":"#DIV/0!"},{"$error":"#DIV/0!"},{"$error":"#DIV/0!"},1,{"$f":"'Daves pad 6 (Shikar mod)'!R54","v":1800}]
[{"$nulls":6},"DOX125F",117,129,"TCAE-V-2",{"$f":"Formulae!C15","v":{"$error":"#DIV/0!"}},{"v":7.3,"d":"7"},177,123,6,0,{"$f":"IF(AND(K65>$C$4,K65<$C$5),1,0)","v":{"$error":"#DIV/0!"}},{"$error":"#DIV/0!"},{"$error":"#DIV/0!"},1,{"$f":"'Daves pad 6 (Shikar mod)'!R55","v":1500}]
[{"$nulls":6},"DOX150F",140,156,"TCAE-V-3",{"$f":"Formulae!C16","v":{"$error":"#DIV/0!"}},{"v":13.4,"d":"13"},215,148,8,0,{"$error":"#DIV/0!"},{"$error":"#DIV/0!"},{"$error":"#DIV/0!"},1,{"$f":"'Daves pad 6 (Shikar mod)'!R56","v":1200}]
[{"$nulls":6},"DOX175F",162,178,"TCAE-V-4",{"$f":"Formulae!C17","v":{"$error":"#DIV/0!"}},{"v":24.5,"d":"25"},236,170,8,0,{"$error":"#DIV/0!"},{"$error":"#DIV/0!"},{"$error":"#DIV/0!"},1,{"$f":"'Daves pad 6 (Shikar mod)'!R57","v":1000}]
[{"$nulls":6},"DOX200F",196,212,"TCAE-V-5",{"$f":"Formulae!C18","v":{"$error":"#DIV/0!"}},{"v":36.2,"d":"36"},270,204,8,0,{"$error":"#DIV/0!"},{"$error":"#DIV/0!"},{"$error":"#DIV/0!"},1,{"$f":"'Daves pad 6 (Shikar mod)'!R58","v":1000}]
[{"$nulls":6},"DOX225F",249,295,"TCAE-V-6",{"$f":"Formulae!C45","v":{"$error":"#DIV/0!"}},30,225,272,23,0,{"$error":"#DIV/0!"},{"$error":"#DIV/0!"},{"$error":"#DIV/0!"},1,{"$f":"'Daves pad 6 (Shikar mod)'!R59","v":2200}]
[{"$nulls":6},"DOX250F",279,341,"TCAE-V-7",{"$f":"Formulae!C46","v":{"$error":"#DIV/0!"}},39,250,310,31,{"$f":"+IF(AND($C$13>=H70,$C$13<=I70),1,0)","v":0},{"$error":"#DIV/0!"},{"$f":"IF(AND(K70>$C$5,K70<$C$6),1,0)","v":{"$error":"#DIV/0!"}},{"$error":"#DIV/0!"},1,{"$f":"'Daves pad 6 (Shikar mod)'!R60","v":2000}]
[{"$nulls":6},"DOX300F",362,414,"TCAE-V-8",{"$f":"Formulae!C48","v":{"$error":"#DIV/0!"}},50,300,{"$f":"H71+O71","v":388},26,{"$f":"+IF(AND($C$13>=H71,$C$13<=I71),1,0)","v":0},{"$f":"IF(AND(K71>$C$4,K71<$C$5),1,0)","v":{"$error":"#DIV/0!"}},{"$f":"IF(AND(K71>$C$5,K71<$C$6),1,0)","v":{"$error":"#DIV/0!"}},{"$f":"IF(K71>=$C$6,1,0)","v":{"$error":"#DIV/0!"}},1,{"$f":"'Daves pad 6 (Shikar mod)'!R61","v":1800}]
[{"$nulls":6},"DOX350F",377,455,"TCAE-V-9",{"$f":"Formulae!C50","v":{"$error":"#DIV/0!"}},74,350,416,39,{"$f":"+IF(AND($C$13>=H72,$C$13<=I72),1,0)","v":0},{"$error":"#DIV/0!"},{"$error":"#DIV/0!"},{"$error":"#DIV/0!"},1,{"$f":"'Daves pad 6 (Shikar mod)'!R62","v":1600}]
[{"$nulls":6},"DOX390F",423,509,"TCAE-V-10",{"$f":"Formulae!C51","v":{"$error":"#DIV/0!"}},103,390,466,43,0,{"$error":"#DIV/0!"},{"$error":"#DIV/0!"},{"$error":"#DIV/0!"},1,{"$f":"'Daves pad 6 (Shikar mod)'!R63","v":1300}]
[{"$nulls":6},"DOX440F",455,549,"TCAE-V-11",{"$f":"Formulae!C52","v":{"$error":"#DIV/0!"}},137,440,502,47,0,{"$error":"#DIV/0!"},{"$error":"#DIV/0!"},{"$error":"#DIV/0!"},1,{"$f":"'Daves pad 6 (Shikar mod)'!R64","v":1200}]
[{"$nulls":6},"DOX490F",476,580,"TCAE-V-12",{"$f":"Formulae!C53","v":{"$error":"#DIV/0!"}},181,490,528,52,0,{"$error":"#DIV/0!"},{"$error":"#DIV/0!"},{"$error":"#DIV/0!"},1,{"$f":"'Daves pad 6 (Shikar mod)'!R65","v":1100}]
[{"$nulls":6},"DOX550F",506,610,"TCAE-V-13",{"$f":"Formulae!C54","v":{"$error":"#DIV/0!"}},226,550,558,52,0,{"$error":"#DIV/0!"},{"$error":"#DIV/0!"},{"$error":"#DIV/0!"},1,{"$f":"'Daves pad 6 (Shikar mod)'!R66","v":1000}]
[{"$nulls":6},"DOX625F",551,665,"TCAE-V-14",{"$f":"Formulae!C55","v":{"$error":"#DIV/0!"}},274,625,608,57,0,{"$error":"#DIV/0!"},{"$error":"#DIV/0!"},{"$error":"#DIV/0!"},1,{"$f":"'Daves pad 6 (Shikar mod)'!R67","v":800}]
[]
[{"$nulls":6},{"$f":"IF(G80=J62,J62,INDEX(J62:J77,MATCH(G80,J62:J77,0)-1,1))","v":{"$error":"#DIV/0!"}},"LESSER",{"$f":"IFERROR(+VLOOKUP(G79,J62:K77,2,FALSE)/hourpa,0)","v":{"v":0,"d":"0.0"}},{"$f":"IFERROR(INDEX(H62:H77,MATCH(G79,J62:J77,0)),\"-\")","v":"-"},{"$f":"IFERROR(INDEX(I62:I77,MATCH(G79,J62:J77,0)),\"-\")","v":"-"},{"$f":"IF(I79<$B$4,0,IF(AND(I79>=$B$4,I79<$B$5,$B$2<=M79),$B$4,IF(AND(I79>=$B$5,I79<$B$6,$B$2<=M79),$B$5,IF(AND(I79>=$B$6,I79<=$F$2,$B$2<=M79),$B$6,0))))","v":0},{"$f":"IFERROR(INDEX(U62:U77,MATCH(G79,J62:J77,0)),\"-\")","v":"-"},{"$nulls":3},{"$f":"IF(AND(P62=1,Q62=1,T62=1),J62,IF(AND(P63=1,Q63=1,T63=1),J63,IF(AND(P64=1,Q64=1,T64=1),J64,IF(AND(P65=1,Q65=1,T65=1),J65,IF(AND(P66=1,Q66=1,T66=1),J66,IF(AND(P67=1,Q67=1,T67=1),J67,IF(AND(P68=1,Q68=1,T68=1),J68,IF(AND(P69=1,Q69=1,T69=1),J69,IF(AND(P70=1,Q70=1,T70=1),J70,IF(AND(P71=1,Q71=1,T71=1),J71,IF(AND(P72=1,Q72=1,T72=1),J72,IF(AND(P73=1,Q73=1,T73=1),J73,IF(AND(P74=1,Q74=1,T74=1),J74,IF(AND(P75=1,Q75=1,T75=1),J75,IF(AND(P76=1,Q76=1,T76=1),J76,IF(AND(P77=1,Q77=1,T77=1),J77,\"-\"))))))))))))))))","v":{"$error":"#DIV/0!"}},"OPTION1",{"$f":"IFERROR(+VLOOKUP(Q79,J62:K77,2,FALSE)/hourpa,\"-\")","v":"-"},{"$f":"IFERROR(INDEX(U62:U77,MATCH(Q79,J62:J77,0)),\"-\")","v":"-"}]
[{"$nulls":6},{"$f":"+IF(C5<'Model tables'!K62,'Model tables'!J62,+IF(C5<'Model tables'!K63,'Model tables'!J63,+IF(C5<'Model tables'!K64,'Model tables'!J64,+IF(C5<'Model tables'!K65,'Model tables'!J65,+IF(C5<'Model tables'!K66,'Model tables'!J66,+IF(C5<'Model tables'!K67,'Model tables'!J67,+IF(C5<'Model tables'!K68,'Model tables'!J68,+IF(C5<'Model tables'!K69,'Model tables'!J69,+IF(C5<'Model tables'!K70,'Model tables'!J70,IF(C5<'Model tables'!K71,'Model tables'!J71,+IF(C5<'Model tables'!K72,'Model tables'!J72,+IF(C5<'Model tables'!K73,'Model tables'!J73,+IF(C5<'Model tables'!K74,'Model tables'!J74,+IF(C5<'Model tables'!K75,'Model tables'!J75,+IF(C5<'Model tables'!K76,'Model tables'!J76,+IF(C5<'Model tables'!K77,'Model tables'!J77,\"-\"))))))))))))))))","v":{"$error":"#DIV/0!"}},"IDEAL",{"$f":"IFERROR(+VLOOKUP(G80,J62:K77,2,FALSE)/hourpa,0)","v":{"v":0,"d":"0.0"}},{"$f":"IFERROR(INDEX(H62:H77,MATCH(G80,J62:J77,0)),\"-\")","v":"-"},{"$f":"IFERROR(INDEX(I62:I77,MATCH(G80,J62:J77,0)),\"-\")","v":"-"},{"$f":"IF(I80<$B$4,0,IF(AND(I80>=$B$4,I80<$B$5,$B$2<=M80),$B$4,IF(AND(I80>=$B$5,I80<$B$6,$B$2<=M80),$B$5,IF(AND(I80>=$B$6,I80<=$F$2,$B$2<=M80),$B$6,0))))","v":0},{"$f":"IFERROR(INDEX(U62:U77,MATCH(G80,J62:J77,0)),\"-\")","v":"-"},{"$nulls":3},{"$f":"IF(AND(P62=1,R62=1,T62=1),J62,IF(AND(P63=1,R63=1,T63=1),J63,IF(AND(P64=1,R64=1,T64=1),J64,IF(AND(P65=1,R65=1,T65=1),J65,IF(AND(P66=1,R66=1,T66=1),J66,IF(AND(P67=1,R67=1,T67=1),J67,IF(AND(P68=1,R68=1,T68=1),J68,IF(AND(P69=1,R69=1,T69=1),J69,IF(AND(P70=1,R70=1,T70=1),J70,IF(AND(P71=1,R71=1,T71=1),J71,IF(AND(P72=1,R72=1,T72=1),J72,IF(AND(P73=1,R73=1,T73=1),J73,IF(AND(P74=1,R74=1,T74=1),J74,IF(AND(P75=1,R75=1,T75=1),J75,IF(AND(P76=1,R76=1,T76=1),J76,IF(AND(P77=1,R77=1,T77=1),J77,\"-\"))))))))))))))))","v":{"$error":"#DIV/0!"}},"OPTION2",{"$f":"IFERROR(+VLOOKUP(Q80,J62:K77,2,FALSE)/hourpa,\"-\")","v":"-"},{"$f":"IFERROR(INDEX(U62:U77,MATCH(Q80,J62:J77,0)),\"-\")","v":"-"}]
[{"$nulls":6},{"$f":"IF(G80=J77,J77,INDEX(J62:J77,MATCH(G80,J62:J77,0)+1,1))","v":{"$error":"#DIV/0!"}},"GREATER",{"$f":"IFERROR(+VLOOKUP(G81,J62:K77,2,FALSE)/hourpa,0)","v":{"v":0,"d":"0.0"}},{"$f":"IFERROR(INDEX(H62:H77,MATCH(G81,J62:J77,0)),\"-\")","v":"-"},{"$f":"IFERROR(INDEX(I62:I77,MATCH(G81,J62:J77,0)),\"-\")","v":"-"},{"$f":"IF(I81<$B$4,0,IF(AND(I81>=$B$4,I81<$B$5,$B$2<=M81),$B$4,IF(AND(I81>=$B$5,I81<$B$6,$B$2<=M81),$B$5,IF(AND(I81>=$B$6,I81<=$F$2,$B$2<=M81),$B$6,0))))","v":0},{"$f":"IFERROR(INDEX(U62:U77,MATCH(G81,J62:J77,0)),\"-\")","v":"-"},{"$nulls":3},{"$f":"IF(AND(P62=1,S62=1,T62=1),J62,IF(AND(P63=1,S63=1,T63=1),J63,IF(AND(P64=1,S64=1,T64=1),J64,IF(AND(P65=1,S65=1,T65=1),J65,IF(AND(P66=1,S66=1,T66=1),J66,IF(AND(P67=1,S67=1,T67=1),J67,IF(AND(P68=1,S68=1,T68=1),J68,IF(AND(P69=1,S69=1,T69=1),J69,IF(AND(P70=1,S70=1,T70=1),J70,IF(AND(P71=1,S71=1,T71=1),J71,IF(AND(P72=1,S72=1,T72=1),J72,IF(AND(P73=1,S73=1,T73=1),J73,IF(AND(P74=1,S74=1,T74=1),J74,IF(AND(P75=1,S75=1,T75=1),J75,IF(AND(P76=1,S76=1,T76=1),J76,IF(AND(P77=1,S77=1,T77=1),J77,\"-\"))))))))))))))))","v":{"$error":"#DIV/0!"}},"OPTION3",{"$f":"IFERROR(+VLOOKUP(Q81,J62:K77,2,FALSE)/hourpa,\"-\")","v":"-"},{"$f":"IFERROR(INDEX(U62:U77,MATCH(Q81,J62:J77,0)),\"-\")","v":"-"}]
[{"$nulls":6},"DBSE"]
[{"$nulls":6},"min","max"]
[{"$nulls":6},{"$f":"IFERROR(INDEX(H62:H77,MATCH(G80,J62:J77,0)),\"-\")","v":"-"},{"$f":"IFERROR(INDEX(I62:I77,MATCH(G80,J62:J77,0)),\"-\")","v":"-"}]
[]
[{"$nulls":7},"Arg 5"]
[{"$nulls":6},"V-Series",{"$f":"+IFERROR(IF(AND($C$13>=(G84-250), $C$13<=(H84+250)),1,\"-\"),\"-\")","v":"-"}]
[]
[]
[{"$nulls":6},"L-Series"]
[{"$nulls":6},"Model","D.B.S.E. ",null,"TCAE MODEL","LIFE hrs","weight","Dia","DBSE","Life Option1 ","Life Option2","Life Option3","Speed","Max rpm"]
[{"$nulls":7},"max 1","max 2",null,null,"kg","mm","Check","Check","Check","Check","Check"]
[{"$nulls":6},"BC75 - L",90,1500,"TCAE-0-L",{"$f":"+Formulae!C12","v":{"$error":"#DIV/0!"}},"L dependant",117]
[{"$nulls":6},"BC87 - L",110,1500,"TCAE-0E-L",{"$f":"+Formulae!C13","v":{"$error":"#DIV/0!"}},"L dependant",134]
[{"$nulls":6},"BJ095 - L",307,1800,"TCAE-L-1",{"$f":"+Formulae!C19","v":{"$error":"#DIV/0!"}},"L dependant",148,{"$f":"+IF(AND($C$13>=H95,$C$13<=I95),1,0)","v":0},{"$f":"IF(AND(K95>$C$4,K95<$C$5),1,0)","v":{"$error":"#DIV/0!"}},{"$f":"IF(AND(K95>$C$5,K95<$C$6),1,0)","v":{"$error":"#DIV/0!"}},{"$f":"IF(K95>=$C$6,1,0)","v":{"$error":"#DIV/0!"}},{"$f":"IF($B$2<=S95,1,0)","v":1},{"$f":"'Daves pad 6 (Shikar mod)'!S15","v":3600}]
[{"$nulls":6},"BJ125 - L",386,2000,"TCAE-L-2",{"$f":"+Formulae!C20","v":{"$error":"#DIV/0!"}},"L dependant",178,{"$f":"+IF(AND($C$13>=H96,$C$13<=I96),1,0)","v":0},{"$f":"IF(AND(K96>$C$4,K96<$C$5),1,0)","v":{"$error":"#DIV/0!"}},{"$f":"IF(AND(K96>$C$5,K96<$C$6),1,0)","v":{"$error":"#DIV/0!"}},{"$f":"IF(K96>=$C$6,1,0)","v":{"$error":"#DIV/0!"}},{"$f":"IF($B$2<=S96,1,0)","v":1},{"$f":"'Daves pad 6 (Shikar mod)'!S16","v":3600}]
[{"$nulls":6},"BJ150 - L",429,2000,"TCAE-L-3",{"$f":"+Formulae!C21","v":{"$error":"#DIV/0!"}},"L dependant",215,0,{"$error":"#DIV/0!"},{"$error":"#DIV/0!"},{"$f":"IF(K97>=$C$6,1,0)","v":{"$error":"#DIV/0!"}},1,{"$f":"'Daves pad 6 (Shikar mod)'!S17","v":3000}]
[{"$nulls":6},"BJ175 - L",473,2000,"TCAE-L-4",{"$f":"+Formulae!C22","v":{"$error":"#DIV/0!"}},"L dependant",253,0,{"$error":"#DIV/0!"},{"$error":"#DIV/0!"},{"$error":"#DIV/0!"},1,{"$f":"'Daves pad 6 (Shikar mod)'!S18","v":3000}]
[{"$nulls":6},"BJ200 - L",500,2000,"TCAE-L-5",{"$f":"+Formulae!C23","v":{"$error":"#DIV/0!"}},"L dependant",278,0,{"$f":"IF(AND(K99>$C$4,K99<$C$5),1,0)","v":{"$error":"#DIV/0!"}},{"$f":"IF(AND(K99>$C$5,K99<$C$6),1,0)","v":{"$error":"#DIV/0!"}},{"$error":"#DIV/0!"},1,{"$f":"'Daves pad 6 (Shikar mod)'!S19","v":3000}]
[{"$nulls":6},"BJ225 - L",582,2000,"TCAE-L-6",{"$f":"+Formulae!C24","v":{"$error":"#DIV/0!"}},"L dependant",300,0,{"$error":"#DIV/0!"},{"$error":"#DIV/0!"},{"$error":"#DIV/0!"},1,{"$f":"'Daves pad 6 (Shikar mod)'!S20","v":2700}]
[{"$nulls":6},"BJ250 - L",643,2000,"TCAE-L-7",{"$f":"+Formulae!C25","v":{"$error":"#DIV/0!"}},"L dependant",330,0,{"$error":"#DIV/0!"},{"$error":"#DIV/0!"},{"$error":"#DIV/0!"},1,{"$f":"'Daves pad 6 (Shikar mod)'!S21","v":2300}]
[{"$nulls":6},"BJ300 - L",760,2000,"TCAE-L-8",{"$f":"+Formulae!C26","v":{"$error":"#DIV/0!"}},"L dependant",370,0,{"$error":"#DIV/0!"},{"$error":"#DIV/0!"},{"$error":"#DIV/0!"},1,{"$f":"'Daves pad 6 (Shikar mod)'!S22","v":2000}]
[]
[{"$nulls":6},{"$f":"IF(G105=J95,J95,INDEX(J95:J102,MATCH(G105,J95:J102,0)-1,1))","v":{"$error":"#DIV/0!"}},"LESSER",{"$f":"IFERROR(+VLOOKUP(G104,J95:K102,2,FALSE)/hourpa,0)","v":{"v":0,"d":"0.0"}},{"$f":"IFERROR(INDEX(H95:H102,MATCH(G104,J95:J102,0)),\"-\")","v":"-"},{"$f":"IFERROR(INDEX(I95:I102,MATCH(G104,J95:J102,0)),\"-\")","v":"-"},{"$f":"IF(I104<$B$4,0,IF(AND(I104>=$B$4,I104<$B$5,$B$2<=M104),$B$4,IF(AND(I104>=$B$5,I104<$B$6,$B$2<=M104),$B$5,IF(AND(I104>=$B$6,I104<=$F$2,$B$2<=M104),$B$6,0))))","v":0},{"$f":"IFERROR(INDEX(S95:S102,MATCH(G104,J95:J102,0)),\"-\")","v":"-"},{"$nulls":3},{"$f":"IF(AND(N95=1,O95=1,R95=1),J95,IF(AND(N96=1,O96=1,R96=1),J96,IF(AND(N97=1,O97=1,R97=1),J97,IF(AND(N98=1,O98=1,R98=1),J98,IF(AND(N99=1,O99=1,R99=1),J99,IF(AND(N100=1,O100=1,R100=1),J100,IF(AND(N101=1,O101=1,R101=1),J101,IF(AND(N102=1,O102=1,R102=1),J102,\"-\"))))))))","v":{"$error":"#DIV/0!"}},"OPTION1",{"$f":"IFERROR(+VLOOKUP(Q104,J95:K102,2,FALSE)/hourpa,\"-\")","v":"-"},{"$f":"IFERROR(INDEX(S95:S102,MATCH(Q104,J95:J102,0)),\"-\")","v":"-"}]
[{"$nulls":6},{"$f":"+IF(C5<'Model tables'!K95,'Model tables'!J95,+IF(C5<'Model tables'!K96,'Model tables'!J96,+IF(C5<'Model tables'!K97,'Model tables'!J97,+IF(C5<'Model tables'!K98,'Model tables'!J98,+IF(C5<'Model tables'!K99,'Model tables'!J99,+IF(C5<'Model tables'!K100,'Model tables'!J100,+IF(C5<'Model tables'!K101,'Model tables'!J101,+IF(C5<'Model tables'!K102,'Model tables'!J102,\"-\"))))))))","v":{"$error":"#DIV/0!"}},"IDEAL",{"$f":"IFERROR(+VLOOKUP(G105,J95:K102,2,FALSE)/hourpa,0)","v":{"v":0,"d":"0.0"}},{"$f":"IFERROR(INDEX(H95:H102,MATCH(G105,J95:J102,0)),\"-\")","v":"-"},{"$f":"IFERROR(INDEX(I95:I102,MATCH(G105,J95:J102,0)),\"-\")","v":"-"},{"$f":"IF(I105<$B$4,0,IF(AND(I105>=$B$4,I105<$B$5,$B$2<=M105),$B$4,IF(AND(I105>=$B$5,I105<$B$6,$B$2<=M105),$B$5,IF(AND(I105>=$B$6,I105<=$F$2,$B$2<=M105),$B$6,0))))","v":0},{"$f":"IFERROR(INDEX(S95:S102,MATCH(G105,J95:J102,0)),\"-\")","v":"-"},{"$nulls":3},{"$f":"IF(AND(N95=1,P95=1,R95=1),J95,IF(AND(N96=1,P96=1,R96=1),J96,IF(AND(N97=1,P97=1,R97=1),J97,IF(AND(N98=1,P98=1,R98=1),J98,IF(AND(N99=1,P99=1,R99=1),J99,IF(AND(N100=1,P100=1,R100=1),J100,IF(AND(N101=1,P101=1,R101=1),J101,IF(AND(N102=1,P102=1,R102=1),J102,\"-\"))))))))","v":{"$error":"#DIV/0!"}},"OPTION2",{"$f":"IFERROR(+VLOOKUP(Q105,J95:K102,2,FALSE)/hourpa,\"-\")","v":"-"},{"$f":"IFERROR(INDEX(S95:S102,MATCH(Q105,J95:J102,0)),\"-\")","v":"-"}]
[{"$nulls":6},{"$f":"IF(G105=J102,J102,INDEX(J95:J102,MATCH(G105,J95:J102,0)+1,1))","v":{"$error":"#DIV/0!"}},"GREATER",{"$f":"IFERROR(+VLOOKUP(G106,J95:K102,2,FALSE)/hourpa,0)","v":{"v":0,"d":"0.0"}},{"$f":"IFERROR(INDEX(H95:H102,MATCH(G106,J95:J102,0)),\"-\")","v":"-"},{"$f":"IFERROR(INDEX(I95:I102,MATCH(G106,J95:J102,0)),\"-\")","v":"-"},{"$f":"IF(I106<$B$4,0,IF(AND(I106>=$B$4,I106<$B$5,$B$2<=M106),$B$4,IF(AND(I106>=$B$5,I106<$B$6,$B$2<=M106),$B$5,IF(AND(I106>=$B$6,I106<=$F$2,$B$2<=M106),$B$6,0))))","v":0},{"$f":"IFERROR(INDEX(S95:S102,MATCH(G106,J95:J102,0)),\"-\")","v":"-"},{"$nulls":3},{"$f":"IF(AND(N95=1,Q95=1,R95=1),J95,IF(AND(N96=1,Q96=1,R96=1),J96,IF(AND(N97=1,Q97=1,R97=1),J97,IF(AND(N98=1,Q98=1,R98=1),J98,IF(AND(N99=1,Q99=1,R99=1),J99,IF(AND(N100=1,Q100=1,R100=1),J100,IF(AND(N101=1,Q101=1,R101=1),J101,IF(AND(N102=1,Q102=1,R102=1),J102,\"-\"))))))))","v":{"$error":"#DIV/0!"}},"OPTION3",{"$f":"IFERROR(+VLOOKUP(Q106,J95:K102,2,FALSE)/hourpa,\"-\")","v":"-"},{"$f":"IFERROR(INDEX(S95:S102,MATCH(Q106,J95:J102,0)),\"-\")","v":"-"}]
[{"$nulls":6},"DBSE"]
[{"$nulls":6},"min","max"]
[{"$nulls":6},{"$f":"IFERROR(INDEX(H95:H102,MATCH(G105,J95:J102,0)),\"-\")","v":"-"},{"$f":"IFERROR(INDEX(I95:I102,MATCH(G105,J95:J102,0)),\"-\")","v":"-"}]
[]
[]
[{"$nulls":7},"Arg 3"]
[{"$nulls":6},"L-Series",{"$f":"+IFERROR(IF(AND($C$13>=G109, $C$13<=H109),1,\"-\"),\"-\")","v":"-"}]
[]
[]
[{"$nulls":6},"CM-Series"]
[{"$nulls":6},"Model","D.B.S.E. ",null,"TCAE MODEL","LIFE hrs","weight","dia","DBSE","Life Option1 ","Life Option2","Life Option3","Speed"]
[{"$nulls":7},"max 1","max 2",null,null,"kg","mm","Check","Check","Check","Check","Check","Max rpm","Min with solid shaft","Min with tubular shaft "]
[{"$nulls":6},"DOJ350 - CM",535,2500,"TCAE-CM-9",{"$f":"+Formulae!C35","v":{"$error":"#DIV/0!"}},"L dependant",336,{"$f":"+IF(AND($C$13>=H119,$C$13<=I119),1,0)","v":0},{"$f":"IF(AND(K119>$C$4,K119<$C$5),1,0)","v":{"$error":"#DIV/0!"}},{"$f":"IF(AND(K119>$C$5,K119<$C$6),1,0)","v":{"$error":"#DIV/0!"}},{"$f":"IF(K119>=$C$6,1,0)","v":{"$error":"#DIV/0!"}},{"$f":"IF($B$2<=S119,1,0)","v":1},{"$f":"'Daves pad 6 (Shikar mod)'!S23","v":1600},535,740]
[{"$nulls":6},"DOJ400 - CM",570,2500,"TCAE-CM-10",{"$f":"+Formulae!C36","v":{"$error":"#DIV/0!"}},"L dependant",376,{"$f":"+IF(AND($C$13>=H120,$C$13<=I120),1,0)","v":0},{"$f":"IF(AND(K120>$C$4,K120<$C$5),1,0)","v":{"$error":"#DIV/0!"}},{"$f":"IF(AND(K120>$C$5,K120<$C$6),1,0)","v":{"$error":"#DIV/0!"}},{"$f":"IF(K120>=$C$6,1,0)","v":{"$error":"#DIV/0!"}},{"$f":"IF($B$2<=S120,1,0)","v":1},{"$f":"'Daves pad 6 (Shikar mod)'!S24","v":1300},570,810]
[{"$nulls":6},"DOJ450 - CM",650,3000,"TCAE-CM-11",{"$f":"+Formulae!C37","v":{"$error":"#DIV/0!"}},"L dependant",420,0,{"$error":"#DIV/0!"},{"$f":"IF(AND(K121>$C$5,K121<$C$6),1,0)","v":{"$error":"#DIV/0!"}},{"$f":"IF(K121>=$C$6,1,0)","v":{"$error":"#DIV/0!"}},1,{"$f":"'Daves pad 6 (Shikar mod)'!S25","v":1200},650,900]
[{"$nulls":6},"DOJ500 - CM",715,3000,"TCAE-CM-12",{"$f":"+Formulae!C38","v":{"$error":"#DIV/0!"}},"L dependant",462,0,{"$error":"#DIV/0!"},{"$error":"#DIV/0!"},{"$error":"#DIV/0!"},1,{"$f":"'Daves pad 6 (Shikar mod)'!S26","v":1100},715,1000]
[{"$nulls":6},"DOJ550 - CM",770,3000,"TCAE-CM-13",{"$f":"+Formulae!C39","v":{"$error":"#DIV/0!"}},"L dependant",504,0,{"$error":"#DIV/0!"},{"$error":"#DIV/0!"},{"$error":"#DIV/0!"},1,{"$f":"'Daves pad 6 (Shikar mod)'!S27","v":1000},770,1070]
[{"$nulls":6},"DOJ625 - CM",840,3000,"TCAE-CM-14",{"$f":"+Formulae!C40","v":{"$error":"#DIV/0!"}},"L dependant",580,0,{"$error":"#DIV/0!"},{"$error":"#DIV/0!"},{"$error":"#DIV/0!"},1,{"$f":"'Daves pad 6 (Shikar mod)'!S28","v":800},840,1170]
[{"$nulls":6},"N/A"]
[]
[{"$nulls":6},{"$f":"IF(G128=J119,J119,INDEX(J119:J124,MATCH(G128,J119:J124,0)-1,1))","v":{"$error":"#DIV/0!"}},"LESSER",{"$f":"IFERROR(+VLOOKUP(G127,J119:K124,2,FALSE)/hourpa,0)","v":{"v":0,"d":"0.0"}},{"$f":"IFERROR(INDEX(H119:H124,MATCH(G127,J119:J124,0)),\"-\")","v":"-"},{"$f":"IFERROR(INDEX(I119:I124,MATCH(G127,J119:J124,0)),\"-\")","v":"-"},{"$f":"IF(I127<$B$4,0,IF(AND(I127>=$B$4,I127<$B$5,$B$2<=M127),$B$4,IF(AND(I127>=$B$5,I127<$B$6,$B$2<=M127),$B$5,IF(AND(I127>=$B$6,I127<=$F$2,$B$2<=M127),$B$6,0))))","v":0},{"$f":"IFERROR(INDEX(S119:S124,MATCH(G127,J119:J124,0)),\"-\")","v":"-"},{"$nulls":3},{"$f":"IF(AND(N119=1,O119=1,R119=1),J119,IF(AND(N120=1,O120=1,R120=1),J120,IF(AND(N121=1,O121=1,R121=1),J121,IF(AND(N122=1,O122=1,R122=1),J122,IF(AND(N123=1,O123=1,R123=1),J123,IF(AND(N124=1,O124=1,R124=1),J124,\"-\"))))))","v":{"$error":"#DIV/0!"}},"OPTION1",{"$f":"IFERROR(VLOOKUP(Q127,J119:K124,2,FALSE)/hourpa,\"-\")","v":"-"},{"$f":"IFERROR(INDEX(S119:S124,MATCH(Q127,J119:J124,0)),\"-\")","v":"-"}]
[{"$nulls":6},{"$f":"+IF(C5<'Model tables'!K119,'Model tables'!J119,+IF(C5<'Model tables'!K120,'Model tables'!J120,+IF(C5<'Model tables'!K121,'Model tables'!J121,+IF(C5<'Model tables'!K122,'Model tables'!J122,+IF(C5<'Model tables'!K123,'Model tables'!J124,+IF(C5<'Model tables'!K124,'Model tables'!J123,\"-\"))))))","v":{"$error":"#DIV/0!"}},"IDEAL",{"$f":"IFERROR(+VLOOKUP(G128,J119:K124,2,FALSE)/hourpa,0)","v":{"v":0,"d":"0.0"}},{"$f":"IFERROR(INDEX(H119:H124,MATCH(G128,J119:J124,0)),\"-\")","v":"-"},{"$f":"IFERROR(INDEX(I119:I124,MATCH(G128,J119:J124,0)),\"-\")","v":"-"},{"$f":"IF(I128<$B$4,0,IF(AND(I128>=$B$4,I128<$B$5,$B$2<=M128),$B$4,IF(AND(I128>=$B$5,I128<$B$6,$B$2<=M128),$B$5,IF(AND(I128>=$B$6,I128<=$F$2,$B$2<=M128),$B$6,0))))","v":0},{"$f":"IFERROR(INDEX(S119:S124,MATCH(G128,J119:J124,0)),\"-\")","v":"-"},{"$nulls":3},{"$f":"IF(AND(N119=1,P119=1,R119=1),J119,IF(AND(N120=1,P120=1,R120=1),J120,IF(AND(N121=1,P121=1,R121=1),J121,IF(AND(N122=1,P122=1,R122=1),J122,IF(AND(N123=1,P123=1,R123=1),J123,IF(AND(N124=1,P124=1,R124=1),J124,\"-\"))))))","v":{"$error":"#DIV/0!"}},"OPTION2",{"$f":"IFERROR(VLOOKUP(Q128,J119:K124,2,FALSE)/hourpa,\"-\")","v":"-"},{"$f":"IFERROR(INDEX(S119:S124,MATCH(Q128,J119:J124,0)),\"-\")","v":"-"}]
[{"$nulls":6},{"$f":"IF(G128=J124,J124,INDEX(J119:J124,MATCH(G128,J119:J124,0)+1,1))","v":{"$error":"#DIV/0!"}},"GREATER",{"$f":"IFERROR(+VLOOKUP(G129,J119:K124,2,FALSE)/hourpa,0)","v":{"v":0,"d":"0.0"}},{"$f":"IFERROR(INDEX(H119:H124,MATCH(G129,J119:J124,0)),\"-\")","v":"-"},{"$f":"IFERROR(INDEX(I119:I124,MATCH(G129,J119:J124,0)),\"-\")","v":"-"},{"$f":"IF(I129<$B$4,0,IF(AND(I129>=$B$4,I129<$B$5,$B$2<=M129),$B$4,IF(AND(I129>=$B$5,I129<$B$6,$B$2<=M129),$B$5,IF(AND(I129>=$B$6,I129<=$F$2,$B$2<=M129),$B$6,0))))","v":0},{"$f":"IFERROR(INDEX(S119:S124,MATCH(G129,J119:J124,0)),\"-\")","v":"-"},{"$nulls":3},{"$f":"IF(AND(N119=1,Q119=1,R119=1),J119,IF(AND(N120=1,Q120=1,R120=1),J120,IF(AND(N121=1,Q121=1,R121=1),J121,IF(AND(N122=1,Q122=1,R122=1),J122,IF(AND(N123=1,Q123=1,R123=1),J123,IF(AND(N124=1,Q124=1,R124=1),J124,\"-\"))))))","v":{"$error":"#DIV/0!"}},"OPTION3",{"$f":"IFERROR(VLOOKUP(Q129,J119:K124,2,FALSE)/hourpa,\"-\")","v":"-"},{"$f":"IFERROR(INDEX(S119:S124,MATCH(Q129,J119:J124,0)),\"-\")","v":"-"}]
[{"$nulls":6},"DBSE"]
[{"$nulls":6},"min","max"]
[{"$nulls":6},{"$f":"IFERROR(INDEX(H119:H124,MATCH(G128,J119:J124,0)),\"-\")","v":"-"},{"$f":"IFERROR(INDEX(I119:I124,MATCH(G128,J119:J124,0)),\"-\")","v":"-"}]
[]
[]
[{"$nulls":7},"Arg 4"]
[{"$nulls":6},"CM-Series",{"$f":"+IFERROR(IF(AND($C$13>=G132, $C$13<=H132),1,\"-\"),\"-\")","v":"-"}]

{"sheet":"Calculations","index":2,"n_rows":47,"n_cols":19,"rows_kept":47,"hidden":true,"merged":[[2,18,3,25],[3,6,3,7],[3,9,3,10],[3,12,3,13]]}
[]
[null,"2. Gather the data entry values to perform initial calculations",{"$nulls":13},"LISTS","Fomula",null,"Notes:"]
[null,"Power",{"$f":"+POWER","v":{"$error":"#VALUE!"}},"kW",null,null,"Tables for constants",{"$nulls":11},"- The diesel engine produces maximum torque at around 2,000rpm, whereas the petrol engine does this at over 4,000rpm\n"]
[null,"Speed",{"$f":"+SPEED","v":0},"rpm",null,null,"Machine service factor K1",null,null,"Time factor K2",null,null,"Angle factor K3",null,null,"Power Source","BHP to kW"]
[null,"Gear ratio",{"$f":"+IF(+RATIO=0,1,+RATIO)","v":1},{"$nulls":3},"Motor type","K1m",null,"hpd","K2",null,"Angle ","K3",null,"CLICK HERE",null,null,"- For frequent start/stop, or reversing loads, use K1d factor of 2, or higher"]
[null,"output speed",{"$f":"+C4/C5","v":0},"rpm",null,null,"CLICK HERE",null,null,0,0,null,0,0.99,null,"kW",null,null,"- for applications > 2000rpm,use only nitrile rubber boots"]
[{"$nulls":6},"Electric Motor",{"v":1,"d":"1.00"},null,2,0.63,null,1,0.98,null,"BHP",{"$f":"ROUNDUP(IF('Data Entry'!D18=\"click Here\",\"\",IF('Data Entry'!D18=\"kW\",'Data Entry'!C18,IF('Data Entry'!D18=\"BHP\",'Data Entry'!C18/1.341,0))),1)","v":{"$error":"#VALUE!"}}]
[null,"Motor type",{"$f":"+TYPE","v":"CLICK HERE"},{"$nulls":3},"Diesel 3cyl or less",{"v":3,"d":"3.00"},null,4,0.79,null,2,0.96]
[{"$nulls":6},"Diesel 4+ cyl",{"v":2,"d":"2.00"},null,6,0.87,null,3,0.94]
[null,"Machine type",{"$f":"+MSF","v":"CLICK HERE"},{"$nulls":3},"Petrol 3cyl or less",{"v":1.5,"d":"1.50"},null,8,{"v":1,"d":"1.00"},null,4,0.92,null,"Size","inches to mm"]
[null,null,{"$f":"+hours","v":0},"hpd",null,null,"Petrol 4+cyl",1.25,null,10,1.08,null,5,{"v":0.9,"d":"0.90"},null,"Motor shaft",{"$f":"ROUNDUP(IF('Data Entry'!D20=\"click Here\",0,IF('Data Entry'!D20=\"mm\",'Data Entry'!C20,IF('Data Entry'!D20=\"inches\",'Data Entry'!C20*25.4,0))),0)","v":0}]
[null,null,{"$f":"+days","v":0},"dpw",null,null,"Turbine",{"v":1,"d":"1.00"},null,12,1.14,null,6,0.88,null,"Gear shaft dia",{"$f":"ROUNDUP(IF('Data Entry'!N19=\"click Here\",0,IF('Data Entry'!N19=\"mm\",'Data Entry'!M19,IF('Data Entry'!N19=\"inches\",'Data Entry'!M19*25.4,0))),0)","v":0}]
[null,null,{"$f":"+weeks","v":0},"wpa",null,null,"Driven type","K1d",null,14,1.21,{"$nulls":4},"DrivenShaftDia",{"$f":"ROUNDUP(IF('Data Entry'!J20=\"click Here\",0,IF('Data Entry'!J20=\"mm\",'Data Entry'!I20,IF('Data Entry'!J20=\"inches\",'Data Entry'!I20*25.4,0))),0)","v":0}]
[{"$nulls":6},"extreme shock",{"v":3,"d":"3.00"},null,16,1.26,{"$nulls":4},"DBSE",{"$f":"ROUNDUP(IF('Data Entry'!J17=\"click Here\",0,IF('Data Entry'!J17=\"mm\",'Data Entry'!I17,IF('Data Entry'!J17=\"inches\",'Data Entry'!I17*25.4,0))),0)","v":0}]
[null,"Motor shaft",{"$f":"+DriveShaftdia.","v":0},"mm",null,null,"heavy duty",{"v":2,"d":"2.00"},null,18,1.31]
[null,"gear shaft dia",{"$f":"+gearshaftdia","v":0},"mm",null,null,"light duty",1.25,null,20,1.36]
[null,"Driven shaft",{"$f":"+DrivenShaftdia.","v":0},"mm",null,null,"medium duty",1.75,null,22,{"v":1.4,"d":"1.40"},{"$nulls":4},"Size"]
[null,"DBSE",{"$f":"+DBSE.","v":0},"mm",null,null,"moderate duty",{"v":1.5,"d":"1.50"},null,24,1.44,{"$nulls":4},"CLICK HERE",null,"CLICK HERE TO CHECK"]
[null,"Angle",{"$f":"+ANGLE","v":0},"degs",null,null,"Smooth",{"v":1,"d":"1.00"},{"$nulls":7},"mm",null,"Y"]
[{"$nulls":6},"very heavy duty",{"v":2.5,"d":"2.50"},null,{"$f":"IF(+gearshaftdia=\"\",0,gearshaftdia)","v":0},{"$nulls":5},"inches",null,"N"]
[]
["Calculations:",{"$nulls":5},"For List only In Procedure V24"]
[null,"Motor torque",{"$f":"IF(OR(TYPE=\"Electric Motor\",TYPE=\"Turbine\"),(+C3*9550/C4),MAX((+C3*9550/C4),Q26))","v":{"$error":"#VALUE!"}},"Nm",null,null,"CLICK HERE",{"$nulls":8},"Peak Torque","lb.ft to nm"]
[null,"Gear torque",{"$f":"+C23*C5","v":{"$error":"#VALUE!"}},"Nm",null,null,"Smooth",{"v":1,"d":"1.00"}]
[{"$nulls":6},"Light Duty",1.25,{"$nulls":7},"Nm"]
[null,"Drive torque",{"$f":"+MAX(C23:C24)","v":{"$error":"#VALUE!"}},"Nm",null,null,"Moderate Duty",{"v":1.5,"d":"1.50"},{"$nulls":7},"in.lbs",{"$f":"ROUNDUP(IF('Data Entry'!E19=\"Nm\",'Data Entry'!E18,IF('Data Entry'!E19=\"in.lbs\",'Data Entry'!E18/8.8507,0)),2)","v":0}]
[{"$nulls":6},"Medium Duty",1.75]
[null,"Machine Service Factor K1",{"$nulls":4},"Heavy Duty",{"v":2,"d":"2.00"}]
[null,"K1m",{"$f":"+VLOOKUP(C8,G7:H12,2,FALSE)","v":{"$error":"#N/A"}},{"$nulls":3},"Very Heavy Duty",{"v":2.5,"d":"2.50"}]
[null,"K1d",{"$f":"IF('Data Entry'!C22=\"Y\",MAX(2,VLOOKUP(C10,G14:H20,2)),+VLOOKUP(C10,G14:H20,2))","v":{"$error":"#N/A"}},{"$nulls":3},"Extreme Shock",{"v":3,"d":"3.00"}]
[]
[null,"K1",{"$f":"+MAX(C29:C30)","v":{"$error":"#N/A"}}]
[]
[null,"Operating time factor K2"]
[null,"K2",{"$f":"+VLOOKUP(C11,J7:K18,2)","v":{"$error":"#N/A"}}]
[]
[null,"Angle factor K3"]
[null,"K3",{"$f":"+VLOOKUP(C19,M6:N12,2)","v":0.99}]
[]
[]
["Effective Torque calculation"]
[null,"Teff = ",{"$f":"+C26*C32*C35/C38","v":{"$error":"#VALUE!"}},"Nm"]
[]
["Derate torque for actual power usage"]
[null,"Load capacity factor",{"v":0.8,"d":"80%"}]
[]
["Final torque effective",null,{"$f":"+C42*C45","v":{"$error":"#VALUE!"}},"Nm"]

{"sheet":"Formulae","index":3,"n_rows":114,"n_cols":26,"rows_kept":114,"hidden":true,"merged":[[8,23,8,25]]}
["Calculation of coupling type from data entry page"]
["final speed",{"$f":"+output_speed","v":0},"rpm"]
["operational hours",{"$f":"+Calculations!C11","v":0},"hpd"]
["equiv torque ",{"$f":"+Calculations!C47","v":{"$error":"#VALUE!"}},"Nm"]
["service life period",{"$f":"'Model tables'!B4","v":{"v":1,"d":"1.0"}},"year",{"$f":"+hourpa*Formulae!B5","v":0},"hrs"]
["service life period",{"$f":"'Model tables'!B5","v":{"v":2,"d":"2.0"}},"years",{"$f":"+hourpa*Formulae!B6","v":0},"hrs"]
["service life period",{"$f":"'Model tables'!B6","v":{"v":3,"d":"3.0"}},"years",{"$f":"+hourpa*Formulae!B7","v":0},"hrs"]
[]
["Calculated torque limit values at speed",{"$nulls":10},"Working torque vs speed",{"$nulls":11},"This table shows the static rated capacities of the TCAE couplings. Use these values when: Duty cycle is very low (less than 1 hour per day) or when the rotation speed is very low (less than 100 rpm)   \n"]
["Coupling","limit torque","life calc hrs",null,"torque ","at speed","torque ","at speed","max speed",null,"Coupling","range 0-1000 rpm",null,"equation","torque at","torque at","range 1000-4000 rpm",null,"equation","torque at",{"$nulls":3},"NTN ref","Static load and non reversing and minimal starts & stops (Nm)","Static load and reversing and frequent starts & stops (Nm)"]
["DOX68F",{"$f":"IF(B2<1000,292.79*B2^-0.196,649.46*B2^-0.311)","v":{"$error":"#DIV/0!"}},{"$f":"+(B11/$B$4)^3*7200","v":{"$error":"#DIV/0!"}},"TCAE-V-000",{"$f":"P13","v":{"v":186.44736056662867,"d":"186"}},10,{"$f":"O13","v":{"v":75.60599612159034,"d":"76"}},1000,{"$f":"3000","v":3000},"BC68P",null,"Torque","Speed","0-1000 rpm",1000,10,"Torque","Speed","1000-4000 rpm",1500,"rpm",null,"TCAE 0","BC 75",588,392]
["BC75P_A",{"$f":"IF(B2<1000,414.97*(B2^-0.195),956.05*(B2^-0.316))","v":{"$error":"#DIV/0!"}},{"$f":"+(B12/$B$4)^3*7200","v":{"$error":"#DIV/0!"}},"TCAE-V-00",{"$f":"P15","v":{"v":264.8410509599062,"d":"265"}},10,{"$f":"+O15","v":{"v":107.89102091397979,"d":"108"}},1000,3000,"BC75P_A",{"$nulls":12},"TCAE 0E","BC 87",932,637]
["DOX87F",{"$f":"IF(B2<1000,647.62*(B2^-0.196),1459.4*(B2^-0.314))","v":{"$error":"#DIV/0!"}},{"$f":"+(B13/$B$4)^3*7200","v":{"$error":"#DIV/0!"}},"TCAE-V-0",{"$f":"P17","v":{"v":412.4015152503844,"d":"412"}},10,{"$f":"O17","v":{"v":167.2323344658777,"d":"167"}},1000,2000,"BC87P","BC68",null,null,"y =292.79x-0.196",{"$f":"292.79*O11^-0.196","v":{"v":75.60599612159034,"d":"76"}},{"$f":"292.79*P11^-0.196","v":{"v":186.44736056662867,"d":"186"}},null,null,"y = 649.46x-0.311",{"$f":"649.46*T11^-0.311","v":{"v":66.8017787374235,"d":"67"}},null,null,"TCAE 1","BJ 95 DS",{"v":1130,"d":"1,130"},637]
["DOX100F",{"$f":"IF(B2<1000,957.83*B2^-0.197,2066.3*B2^-0.309)","v":{"$error":"#DIV/0!"}},{"$error":"#DIV/0!"},"TCAE-V-1",{"$f":"P19","v":{"v":608.5390264555557,"d":"609"}},10,{"$f":"O19","v":{"v":245.63397446977655,"d":"246"}},1000,1800,"BC100P",{"$nulls":12},"TCAE 2","BJ 125 DS",{"v":2750,"d":"2,750"},{"v":1470,"d":"1,470"}]
["DOX125F",{"$f":"IF(B2<1000,1823.7*B2^-0.19,4261.3*B2^-0.313)","v":{"$error":"#DIV/0!"}},{"$error":"#DIV/0!"},"TCAE-V-2",{"$f":"P21","v":{"v":1177.4796174905011,"d":"1177"}},10,{"$f":"O21","v":{"v":490.8552021921517,"d":"491"}},1000,1500,"BC125P","BC75",null,null,"y = 414.97x-0.195",{"$f":"414.94*(O11^-0.195)","v":{"v":107.89102091397979,"d":"108"}},{"$f":"414.94*(P11^-0.195)","v":{"v":264.8410509599062,"d":"265"}},null,null,"y = 956.05x-0.316",{"$f":"956.05*(T11^-0.316)","v":{"v":94.80598788578642,"d":"95"}},null,null,"TCAE 3","BJ 150 DS",{"v":4710,"d":"4,710"},{"v":2890,"d":"2,890"}]
["DOX150F",{"$f":"IF(B2<1000,3238.1*B2^-0.196,6670.2*B2^-0.301)","v":{"$error":"#DIV/0!"}},{"$error":"#DIV/0!"},"TCAE-V-3",{"$f":"P23","v":{"v":2062.0075762519223,"d":"2062"}},10,{"$f":"O23","v":{"v":836.1616723293885,"d":"836"}},1000,1200,"BC150P",{"$nulls":12},"TCAE 4","BJ 175 DS",{"v":6720,"d":"6,720"},{"v":4020,"d":"4,020"}]
["DOX175F",{"$f":"IF(B2<1000,5041.1*B2^-0.199,10594*B2^-0.306)","v":{"$error":"#DIV/0!"}},{"$error":"#DIV/0!"},"TCAE-V-4",{"$f":"P25","v":{"v":3188.0513839726596,"d":"3188"}},10,{"$f":"O25","v":{"v":1275.044412988466,"d":"1275"}},1000,1000,"BC175P","BC87",null,null,"y = 647.62x-0.196",{"$f":"647.62*O11^-0.196","v":{"v":167.2323344658777,"d":"167"}},{"$f":"647.62*P11^-0.196","v":{"v":412.4015152503844,"d":"412"}},null,null,"y = 1459.4x-0.314",{"$f":"1459.4*T11^-0.314","v":{"v":146.8526157361336,"d":"147"}},null,null,"TCAE 5","BJ 200 DS",{"v":11200,"d":"11,200"},{"v":5880,"d":"5,880"}]
["DOX200F",{"$f":"IF(B2<1000,8531*B2^-0.199,17229*B2^-0.301)","v":{"$error":"#DIV/0!"}},{"$error":"#DIV/0!"},"TCAE-V-5",{"$f":"P27","v":{"v":5395.105504090528,"d":"5395"}},10,{"$f":"O27","v":{"v":2157.7441207682064,"d":"2158"}},1000,1000,"BC200P",{"$nulls":12},"TCAE 6","BJ 225 DS",{"v":14700,"d":"14,700"},{"v":7550,"d":"7,550"}]
["BJ095",{"$f":"IF(B2<1000,940.1*(B2^-0.204),1661.6*(B2^-0.292))","v":{"$error":"#DIV/0!"}},{"$f":"+(B19/$B$4)^3*7200","v":{"$error":"#DIV/0!"}},"TCAE-R-1",{"$f":"+L29","v":588},{"$f":"+M29","v":10},{"$f":"+O29","v":{"v":229.70690625876034,"d":"230"}},1000,3600,null,"BC100",null,null,"y = 957.832x-0.197",{"$f":"957.83*O11^-0.197","v":{"v":245.63397446977655,"d":"246"}},{"$f":"957.83*P11^-0.197","v":{"v":608.5390264555557,"d":"609"}},null,null,"y = 2066.3x-0.309",{"$f":"2066.3*T11^-0.309","v":{"v":215.66574832240016,"d":"216"}},null,null,"TCAE 7","BJ 250 DS",{"v":20700,"d":"20,700"},{"v":10700,"d":"10,700"}]
["BJ125",{"$f":"IF(B2<1000,2019.8*(B2^-0.185),5699.8*(B2^-0.335))","v":{"$error":"#DIV/0!"}},{"$f":"+(B20/$B$4)^3*7200","v":{"$error":"#DIV/0!"}},"TCAE-R-2",{"$f":"+L32","v":981},{"$f":"+M32","v":50},{"$f":"+O32","v":{"v":562.740753639841,"d":"563"}},1000,3600,{"$nulls":13},"TCAE 8","BJ 300 DS",{"v":29100,"d":"29,100"},{"v":15800,"d":"15,800"}]
["BJ150",{"$f":"IF(B2<1000,3680.8*(B2^-0.201),6144.4*(B2^-0.275))","v":{"$error":"#DIV/0!"}},{"$error":"#DIV/0!"},"TCAE-R-3",{"$f":"+L35","v":1960},{"$f":"+M35","v":23},{"$f":"+O35","v":{"v":918.2104270931626,"d":"918"}},1000,3000,null,"BC125",null,null,"y = 1823.7x-0.19",{"$f":"1823.7*O11^-0.19","v":{"v":490.8552021921517,"d":"491"}},{"$f":"1823.7*P11^-0.19","v":{"v":1177.4796174905011,"d":"1177"}},null,null,"y = 4261.3x-0.313",{"$f":"4261.3*T11^-0.313","v":{"v":431.94211053352717,"d":"432"}},null,null,"TCAE 9","DOJ 350",{"v":0,"d":"0.00"},{"v":22900,"d":"22,900"}]
["BJ175",{"$f":"IF(B2<1000,6101.9*(B2^-0.209),15026*(B2^-0.339))","v":{"$error":"#DIV/0!"}},{"$error":"#DIV/0!"},"TCAE-R-4",{"$f":"+L38","v":2940},{"$f":"+M38","v":33},{"$f":"+O38","v":{"v":1440.3402131044563,"d":"1440"}},1000,3000,{"$nulls":13},"TCAE 10","DOJ 400",{"v":0,"d":"0.00"},{"v":34100,"d":"34,100"}]
["BJ200",{"$f":"IF(B2<1000,8596.5*(B2^-0.19),31800*(B2^-0.379))","v":{"$error":"#DIV/0!"}},{"$error":"#DIV/0!"},"TCAE-R-5",{"$f":"+L41","v":3920},{"$f":"+M41","v":62},{"$f":"+O41","v":{"v":2313.7778941957736,"d":"2314"}},1000,3000,null,"BC150",null,null,"y = 3238.1x-0.196",{"$f":"3238.1*O11^-0.196","v":{"v":836.1616723293885,"d":"836"}},{"$f":"3238.1*P11^-0.196","v":{"v":2062.0075762519223,"d":"2062"}},null,null,"y = 6670.2x-0.313",{"$f":"6670.2*T11^-0.313","v":{"v":676.1176790370855,"d":"676"}},null,null,"TCAE 11","DOJ 450",{"v":0,"d":"0.00"},{"v":48500,"d":"48,500"}]
["BJ225",{"$f":"IF(B2<1000,12361*(B2^-0.2),30734*(B2^-0.332))","v":{"$error":"#DIV/0!"}},{"$error":"#DIV/0!"},"TCAE-R-6",{"$f":"+L44","v":6867},{"$f":"+M44","v":19},{"$f":"+O44","v":{"v":3104.942817988992,"d":"3105"}},1000,2700,{"$nulls":13},"TCAE 12","DOJ 500",{"v":0,"d":"0.00"},{"v":66800,"d":"66,800"}]
["BJ250",{"$f":"IF(B2<1000,15962*(B2^-0.184),51095*(B2^-0.352))","v":{"$error":"#DIV/0!"}},{"$error":"#DIV/0!"},"TCAE-R-7",{"$f":"+L47","v":9810},{"$f":"+M47","v":14},{"$f":"+O47","v":{"v":4478.033172898526,"d":"4478"}},1000,2300,null,"BC175",null,null,"y = 5041.1x-0.199",{"$f":"5041.1*O11^-0.199","v":{"v":1275.044412988466,"d":"1275"}},{"$f":"5041.1*P11^-0.199","v":{"v":3188.0513839726596,"d":"3188"}},null,null,"y = 10594x-0.306",{"$f":"10594*T11^-0.306","v":{"v":1130.2539756389035,"d":"1130"}},null,null,"TCAE 13","DOJ 550",{"v":0,"d":"0.00"},{"v":89100,"d":"89,100"}]
["BJ300",{"$f":"+IF(B2<1000,19897*(B2^-0.176),71535*(B2^-0.361))","v":{"$error":"#DIV/0!"}},{"$error":"#DIV/0!"},"TCAE-R-8",{"$f":"+L50","v":9810},{"$f":"+M50","v":55},{"$f":"+O50","v":{"v":5899.125015736584,"d":"5899"}},1000,2000,{"$nulls":13},"TCAE 14","DOJ 625",{"v":0,"d":"0.00"},{"v":116000,"d":"116,000"}]
["DOJ100",{"$f":"874.73*(B2^-0.178)","v":{"$error":"#DIV/0!"}},{"$error":"#DIV/0!"},"TCAE-S-1",{"$f":"L53","v":580},{"$f":"M53","v":10},{"$f":"O53","v":{"v":255.78438094709014,"d":"256"}},{"$f":"M54","v":1000},3000,null,"BC200",null,null,"y = 8531x-0.199",{"$f":"8531*O11^-0.199","v":{"v":2157.7441207682064,"d":"2158"}},{"$f":"8531*P11^-0.199","v":{"v":5395.105504090528,"d":"5395"}},null,null,"y = 17229x-0.301",{"$f":"17229*T11^-0.301","v":{"v":1906.5868882782338,"d":"1907"}}]
["DOJ125",{"$f":"1786.2*(B2^-0.18)","v":{"$error":"#DIV/0!"}},{"$error":"#DIV/0!"},"TCAE-S-2",{"$f":"L56","v":1180},{"$f":"M56","v":10},{"$f":"O56","v":{"v":515.1457070884744,"d":"515"}},{"$f":"M57","v":1000},3000]
["DOJ150",{"$f":"3093.9*(O11^-0.179)","v":{"v":898.4755690647565,"d":"898"}},{"$error":"#VALUE!"},"TCAE-S-3",{"$f":"L59","v":2050},{"$f":"M59","v":10},{"$f":"O59","v":{"v":898.4755690647565,"d":"898"}},{"$f":"M60","v":1000},2500,null,"BJ95",588,10,"y = 940.1x-0.204",{"$f":"940.1*(O11^-0.204)","v":{"v":229.70690625876034,"d":"230"}},{"$f":"940.1*(P11^-0.204)","v":{"v":587.7248484784222,"d":"588"}},196,1500,"y = 1661.6x-0.292",{"$f":"1661.6*(T11^-0.292)","v":{"v":196.38478422667282,"d":"196"}}]
["DOJ175",{"$f":"5191.7*(B2^-0.193)","v":{"$error":"#DIV/0!"}},{"$error":"#DIV/0!"},"TCAE-S-4",{"$f":"L62","v":3330},{"$f":"M62","v":10},{"$f":"O62","v":{"v":1368.7041655789626,"d":"1369"}},{"$f":"M63","v":1000},2500,null,null,294,300,{"$nulls":3},{"v":147.15,"d":"147"},4000]
["DOJ200",{"$f":"8501*(B2^-0.193)","v":{"$error":"#DIV/0!"}},{"$error":"#DIV/0!"},"TCAE-S-5",{"$f":"L65","v":5450},{"$f":"M68","v":10},{"$f":"O65","v":{"v":2241.1453110901557,"d":"2241"}},{"$f":"M66","v":1000},2500]
[{"$f":"+K68","v":"DOJ225"},{"$f":"8794*(B2^-0.193)","v":{"$error":"#DIV/0!"}},{"$error":"#DIV/0!"},"TCAE-S-6",{"$f":"+L68","v":5640},{"$f":"+M68","v":10},{"$f":"+O68","v":{"v":2318.3898206948393,"d":"2318"}},{"$f":"+M69","v":1000},2200,null,"BJ125",981,50,"y = 2019.8x-0.185",{"$f":"2019.8*(O11^-0.185)","v":{"v":562.740753639841,"d":"563"}},{"$f":"2019.8*(P11^-0.185)","v":{"v":1319.1930902373647,"d":"1319"}},{"$f":"50*9.81","v":{"v":490.5,"d":"491"}},1500,"y = 5699.8x-0.335",{"$f":"5699.8*(T11^-0.335)","v":{"v":491.8911911391888,"d":"492"}}]
[{"$f":"+K71","v":"DOJ250"},{"$f":"13805*(B2^-0.195)","v":{"$error":"#DIV/0!"}},{"$error":"#DIV/0!"},"TCAE-S-7",{"$f":"+L71","v":8820},{"$f":"+M71","v":10},{"$f":"+O71","v":{"v":3589.5202769496577,"d":"3590"}},{"$f":"+M72","v":1000},{"$f":"2000","v":2000},null,null,588,800,{"$nulls":3},353,4000]
[{"$f":"+K74","v":"DOJ300"},{"$f":"17989*(B2^-0.194)","v":{"$error":"#DIV/0!"}},{"$error":"#DIV/0!"},"TCAE-S-8",{"$f":"+L74","v":11500},{"$f":"+M74","v":10},{"$f":"+O74","v":{"v":4709.849413485132,"d":"4710"}},{"$f":"+M75","v":1000},{"$f":"1800","v":1800}]
["DOJ350",{"$f":"28118*(B2^-0.191)","v":{"$error":"#DIV/0!"}},{"$error":"#DIV/0!"},"TCAE-CM-9",{"$f":"$L$77","v":18100},{"$f":"$M$77","v":10},{"$f":"$O$77","v":{"v":7515.959419879499,"d":"7516"}},1000,{"$f":"1600","v":1600},null,"BJ150",1960,23,"y = 3680.8x-0.201",{"$f":"3680.8*(O11^-0.201)","v":{"v":918.2104270931626,"d":"918"}},{"$f":"3680.8*(P11^-0.201)","v":{"v":2317.0863578607728,"d":"2317"}},{"$f":"+O35","v":{"v":918.2104270931626,"d":"918"}},{"$f":"+O11","v":1000},"y = 6144.4x-0.275",{"$f":"6144.4*(T11^-0.275)","v":{"v":822.3456211935282,"d":"822"}}]
["DOJ400",{"$f":"42066*(B2^-0.194)","v":{"$error":"#DIV/0!"}},{"$error":"#DIV/0!"},"TCAE-CM-10",{"$f":"$L$80","v":26900},{"$f":"$M$80","v":10},{"$f":"$O$80","v":{"v":11013.648642373983,"d":"11014"}},1000,{"$f":"1300","v":1300},null,null,981,720,{"$nulls":3},627,4000]
["DOJ450",{"$f":"59820*(B2^-0.194)","v":{"$error":"#DIV/0!"}},{"$error":"#DIV/0!"},"TCAE-CM-11",{"$f":"$L$83","v":38300},{"$f":"$M$83","v":10},{"$f":"$O$83","v":{"v":15661.970755165969,"d":"15662"}},1000,{"$f":"1200","v":1200}]
["DOJ500",{"$f":"82127*(B2^-0.193)","v":{"$error":"#DIV/0!"}},{"$error":"#DIV/0!"},"TCAE-CM-12",{"$f":"$L$86","v":52700},{"$f":"$M$86","v":10},{"$f":"$O$86","v":{"v":21651.3987723681,"d":"21651"}},1000,{"$f":"1100","v":1100},null,"BJ175",2940,33,"y = 6101.9x-0.209",{"$f":"6101.9*(O11^-0.209)","v":{"v":1440.3402131044563,"d":"1440"}},{"$f":"6101.9*(P11^-0.209)","v":{"v":3771.0742720045996,"d":"3771"}},{"$f":"+O38","v":{"v":1440.3402131044563,"d":"1440"}},{"$f":"+O11","v":1000},"y = 15026x-0.339",{"$f":"15026*(T11^-0.339)","v":{"v":1259.3558029522196,"d":"1259"}}]
["DOJ550",{"$f":"109688*(B2^-0.193)","v":{"$error":"#DIV/0!"}},{"$error":"#DIV/0!"},"TCAE-CM-13",{"$f":"$L$89","v":70400},{"$f":"$M$89","v":10},{"$f":"$O$89","v":{"v":28917.39170484143,"d":"28917"}},1000,{"$f":"1000","v":1000},null,null,1960,230,{"$nulls":3},981,3100]
["DOJ625",{"$f":"154403*(B2^-0.193)","v":{"$error":"#DIV/0!"}},{"$error":"#DIV/0!"},"TCAE-CM-14",{"$f":"$L$92","v":99000},{"$f":"$M$92","v":10},{"$f":"$O$92","v":{"v":40705.74749655962,"d":"40706"}},1000,{"$f":"800","v":800}]
["n/a",{"$nulls":9},"BJ200",3920,62,"y = 8596.5x-0.19",{"$f":"8596.5*(O11^-0.19)","v":{"v":2313.7778941957736,"d":"2314"}},{"$f":"8596.5*(P11^-0.19)","v":{"v":5550.366579896416,"d":"5550"}},{"$f":"+O41","v":{"v":2313.7778941957736,"d":"2314"}},{"$f":"+O11","v":1000},"y = 31800x-0.379",{"$f":"31800*(T11^-0.379)","v":{"v":1989.2461802525802,"d":"1989"}}]
[{"$nulls":11},2452,730,{"$nulls":3},1471,3300]
["E Series…cont"]
["Model","limit torque","life calc hrs",null,"Speed Max",{"$nulls":5},"BJ225",6867,19,"y = 12361x-0.2",{"$f":"12361*(O11^-0.2)","v":{"v":3104.942817988992,"d":"3105"}},{"$f":"12361*(P11^-0.2)","v":{"v":7799.263735119669,"d":"7799"}},{"$f":"+O44","v":{"v":3104.942817988992,"d":"3105"}},{"$f":"+O11","v":1000},"y = 30734x-0.332",{"$f":"30734*(T11^-0.332)","v":{"v":2711.1702415128034,"d":"2711"}}]
["DOX225F",{"$f":"14199*(B2^-0.193)","v":{"$error":"#DIV/0!"}},{"$f":"+(B45/$B$4)^3*7200","v":{"$error":"#DIV/0!"}},"TCAE-V-6",2200,{"$nulls":6},3920,315,{"$nulls":3},1960,4000]
["DOX250F",{"$f":"18983*(B2^-0.193)","v":{"$error":"#DIV/0!"}},{"$error":"#DIV/0!"},"TCAE-V-7",2000]
["DOX285F",{"$f":"27123*(B2^-0.194)","v":{"$error":"#DIV/0!"}},{"$error":"#DIV/0!"},null,2000,{"$nulls":5},"BJ250",9810,14,"y = 15962x-0.184",{"$f":"15962*(O11^-0.184)","v":{"v":4478.033172898526,"d":"4478"}},{"$f":"15962*(P11^-0.184)","v":{"v":10449.302610461844,"d":"10449"}},{"$f":"+O47","v":{"v":4478.033172898526,"d":"4478"}},{"$f":"+O11","v":1000},"y = 51095x-0.352",{"$f":"51095*(T11^-0.352)","v":{"v":3893.985054305208,"d":"3894"}}]
["DOX300F",{"$f":"39137*(B2^-0.194)","v":{"$error":"#DIV/0!"}},{"$f":"+(B48/$B$4)^3*7200","v":{"$error":"#DIV/0!"}},"TCAE-V-8",1800,{"$nulls":6},4905,600,{"$nulls":3},2940,3300]
["DOX315F",{"$f":" 39632*(B2^-0.194)","v":{"$error":"#DIV/0!"}},{"$error":"#DIV/0!"},null,1800]
["DOX350F",{"$f":"53174*(B2^-0.192)","v":{"$error":"#DIV/0!"}},{"$error":"#DIV/0!"},"TCAE-V-9",1600,{"$nulls":5},"BJ300",9810,55,"y = 19897x-0.176",{"$f":"19897*(O11^-0.176)","v":{"v":5899.125015736584,"d":"5899"}},{"$f":"19897*(P11^-0.176)","v":{"v":13267.45428704344,"d":"13267"}},{"$f":"+O50","v":{"v":5899.125015736584,"d":"5899"}},{"$f":"+O11","v":1000},"y = 71535x-0.361",{"$f":"71535*(T11^-0.361)","v":{"v":5104.458026133312,"d":"5104"}}]
["DOX390F",{"$f":"74256*(B2^-0.194)","v":{"$error":"#DIV/0!"}},{"$error":"#DIV/0!"},"TCAE-V-10",1300,{"$nulls":6},5880,1000,{"$nulls":3},3920,3100]
["DOX440F",{"$f":"89385*(B2^-0.193)","v":{"$error":"#DIV/0!"}},{"$error":"#DIV/0!"},"TCAE-V-11",1200]
["DOX490F",{"$f":" 153385*(B2^-0.193)","v":{"$error":"#DIV/0!"}},{"$error":"#DIV/0!"},"TCAE-V-12",1100,{"$nulls":5},"DOJ100",580,10,"y = 874.73x-0.178",{"$f":"874.73*(O11^-0.178)","v":{"v":255.78438094709014,"d":"256"}},{"$f":"874.73*(P11^-0.178)","v":{"v":580.5959759726617,"d":"581"}}]
["DOX550F",{"$f":"254454*(B2^-0.193)","v":{"$error":"#DIV/0!"}},{"$error":"#DIV/0!"},"TCAE-V-13",1000,{"$nulls":6},255,1000]
["DOX625F",{"$f":"386151.45*(B2^-0.19)","v":{"$error":"#DIV/0!"}},{"$error":"#DIV/0!"},"TCAE-V-14",800]
[{"$nulls":10},"DOJ125",1180,10,"y = 1786.2x-0.18",{"$f":"1786.2*(O11^-0.18)","v":{"v":515.1457070884744,"d":"515"}},{"$f":"1786.2*(P11^-0.18)","v":{"v":1180.130636831168,"d":"1180"}}]
["S series",{"$nulls":10},515,1000]
["Model","limit torque","life calc hrs","BORE d","max speed"]
[{"$nulls":3},"max ",{"$nulls":6},"DOJ150",2050,10,"y = 3093.9x-0.179",{"$f":"3093.9*(O11^-0.179)","v":{"v":898.4755690647565,"d":"898"}},{"$f":"3093.9*(P11^-0.179)","v":{"v":2048.8316408028813,"d":"2049"}}]
["DOJ100",{"$f":"B27","v":{"$error":"#DIV/0!"}},{"$f":"+(B60/$B$4)^3*7200","v":{"$error":"#DIV/0!"}},30,{"$f":"I27","v":3000},{"$nulls":6},900,1000]
["DOJ125",{"$error":"#DIV/0!"},{"$error":"#DIV/0!"},40,{"$f":"I28","v":3000}]
["DOJ150",{"v":898.4755690647565,"d":"898"},{"$error":"#VALUE!"},50,2500,{"$nulls":5},"DOJ175",3330,10,"y = 5191.7x-0.193",{"$f":"5191.7*(O11^-0.193)","v":{"v":1368.7041655789626,"d":"1369"}},{"$f":"5191.7*(P11^-0.193)","v":{"v":3328.9677587571837,"d":"3329"}}]
["DOJ175",{"$error":"#DIV/0!"},{"$error":"#DIV/0!"},55,2500,{"$nulls":6},1370,1000]
["DOJ200",{"$error":"#DIV/0!"},{"$error":"#DIV/0!"},60,{"$f":"I31","v":2500}]
["DOJ225",{"$error":"#DIV/0!"},{"$f":"+(B65/$B$4)^3*7200","v":{"$error":"#DIV/0!"}},65,{"$f":"I32","v":2200},{"$nulls":5},"DOJ200",5450,10,"y = 8501x-0.193",{"$f":"8501*(O11^-0.193)","v":{"v":2241.1453110901557,"d":"2241"}},{"$f":"8501*(P11^-0.193)","v":{"v":5450.9226105504595,"d":"5451"}}]
["DOJ250",{"$f":"B33","v":{"$error":"#DIV/0!"}},{"$f":"+(B66/$B$4)^3*7200","v":{"$error":"#DIV/0!"}},65,{"$f":"I33","v":2000},{"$nulls":6},2240,1000]
["DOJ300",{"$error":"#DIV/0!"},{"$error":"#DIV/0!"},85,1800]
["DOJ350",{"$error":"#DIV/0!"},{"$error":"#DIV/0!"},110,1600,{"$nulls":5},"DOJ225",5640,10,"y = 8794x-0.193",{"$f":"8794*(O11^-0.193)","v":{"v":2318.3898206948393,"d":"2318"}},{"$f":"8794*(P11^-0.193)","v":{"v":5638.797016489912,"d":"5639"}}]
["DOJ400",{"$error":"#DIV/0!"},{"$error":"#DIV/0!"},125,1300,{"$nulls":6},2320,1000]
["DOJ450",{"$error":"#DIV/0!"},{"$error":"#DIV/0!"},130,1200]
["DOJ500",{"$error":"#DIV/0!"},{"$error":"#DIV/0!"},150,1100,{"$nulls":5},"DOJ250",8820,10,"y = 13805x-0.195",{"$f":"13805*(O11^-0.195)","v":{"v":3589.5202769496577,"d":"3590"}},{"$f":"13805*(P11^-0.195)","v":{"v":8811.227426860523,"d":"8811"}}]
["DOJ550",{"$error":"#DIV/0!"},{"$error":"#DIV/0!"},150,1000,{"$nulls":6},3600,1000]
["DOJ625",{"$error":"#DIV/0!"},{"$error":"#DIV/0!"},170,800]
["*DOJ design with BCF static torque because of keyway design",{"$nulls":9},"DOJ300",11500,10,"y = 17989x-0.194",{"$f":"17989*(O11^-0.194)","v":{"v":4709.849413485132,"d":"4710"}},{"$f":"17989*(P11^-0.194)","v":{"v":11508.189955497357,"d":"11508"}}]
[{"$nulls":11},4700,1000]
[]
[{"$nulls":10},"DOJ350",18100,10,"y = 28118x-0.191",{"$f":"  28118*(O11^-0.191)","v":{"v":7515.959419879499,"d":"7516"}},{"$f":"  28118*(P11^-0.191)","v":{"v":18112.751407755753,"d":"18113"}}]
[{"$nulls":11},7500,1000]
[]
[{"$nulls":10},"DOJ400",26900,10,"y = 42066x-0.194",{"$f":" 42066*(O11^-0.194)","v":{"v":11013.648642373983,"d":"11014"}},{"$f":" 42066*(P11^-0.194)","v":{"v":26911.085589413073,"d":"26911"}}]
[{"$nulls":11},11000,1000]
[]
[{"$nulls":10},"DOJ450",38300,10,"y = 59820x-0.194",{"$f":"59820*(O11^-0.194)","v":{"v":15661.970755165969,"d":"15662"}},{"$f":"59820*(P11^-0.194)","v":{"v":38268.93785857201,"d":"38269"}}]
[{"$nulls":11},15700,1000]
[]
[{"$nulls":10},"DOJ500",52700,10,"y =  82127x-0.193",{"$f":"82127*(O11^-0.193)","v":{"v":21651.3987723681,"d":"21651"}},{"$f":"82127*(P11^-0.193)","v":{"v":52660.61889620957,"d":"52661"}}]
[{"$nulls":11},21700,1000]
[]
[{"$nulls":10},"DOJ550",70400,10,"y = 109688x-0.193",{"$f":" 109688*(O11^-0.193)","v":{"v":28917.39170484143,"d":"28917"}},{"$f":" 109688*(P11^-0.193)","v":{"v":70332.99603647321,"d":"70333"}}]
[{"$nulls":11},29000,1000]
[]
[{"$nulls":10},"DOJ625",99000,10,"y = 154403x-0.193",{"$f":" 154403*(O11^-0.193)","v":{"v":40705.74749655962,"d":"40706"}},{"$f":" 154403*(P11^-0.193)","v":{"v":99004.68225347872,"d":"99005"}}]
[{"$nulls":11},40700,1000]
[]
[{"$nulls":10},"BC225F",null,null,"y = 5977.3x-0.214",{"$f":"5977.3*($O$11^-0.214)","v":{"v":1363.02886669681,"d":"1363"}}]
[{"$nulls":10},"BC250F",null,null,"y = 8433x-0.212",{"$f":"8433*($O$11^-0.212)","v":{"v":1949.764237555079,"d":"1950"}}]
[{"$nulls":10},"BC300F",null,null,"y = 14994x-0..21",{"$f":"14994*($O$11^-0.21)","v":{"v":3514.9366856906913,"d":"3515"}}]
[{"$nulls":10},"BC350F",null,null,"y = 24172x-0.21",{"$f":"24172*($O$11^-0.21)","v":{"v":5666.4698923913165,"d":"5666"}}]
[{"$nulls":10},"BC400F",null,null,"y = 36373x-0.209",{"$f":"36373*($O$11^-0.209)","v":{"v":8585.767477547713,"d":"8586"}}]
[{"$nulls":10},"BC450F",null,null,"y = 50250x-0.202",{"$f":"50250*($O$112^-0.202)","v":{"v":5896.114682366239,"d":"5896"}}]
[{"$nulls":10},"BC500F",null,null,"y = 69123x-0.202",{"$f":"69123*($O$11^-0.202)","v":{"v":17124.684488978557,"d":"17125"}}]
[{"$nulls":10},"BC550F",null,null,"y = 92168x-0.201",{"$f":"92168*($O$11^-0.201)","v":{"v":22992.18067928782,"d":"22992"}}]
[{"$nulls":10},"BC600F",null,null,"y = 166875x-0.201",{"$f":"166875*($O$11^-0.201)","v":{"v":41628.549505860545,"d":"41629"}}]
[{"$nulls":10},"DOX225",null,null,"y = 14199x-0.193",{"$f":"14199*($O$11^-0.193)","v":{"v":3743.326934733457,"d":"3743"}},{"$f":"14199*($P$11^-0.193)","v":{"v":9104.53477793271,"d":"9105"}}]
[{"$nulls":10},"DOX250",null,null,"y = 18983x-0.193",{"$f":"18983*($O$11^-0.193)","v":{"v":5004.547869712319,"d":"5005"}},{"$f":"18983*($P$11^-0.193)","v":{"v":12172.081392316124,"d":"12172"}}]
[{"$nulls":10},"DOX285",null,null,"y = 27123x-0.194",{"$f":"27123*($O$11^-0.194)","v":{"v":7101.297773192353,"d":"7101"}},{"$f":"27123*($P$11^-0.194)","v":{"v":17351.527942795863,"d":"17352"}}]
[{"$nulls":10},"DOX300",null,null,"y = 39137x-0.194",{"$f":"39137*($O$11^-0.194)","v":{"v":10246.782839266642,"d":"10247"}},{"$f":"39137*($P$11^-0.194)","v":{"v":25037.302256284398,"d":"25037"}}]
[{"$nulls":10},"DOX315",null,null,"y = 39632x-0.194",{"$f":"39632*($O$11^-0.194)","v":{"v":10376.38289817348,"d":"10376"}},{"$f":"39632*($P$11^-0.194)","v":{"v":25353.97099984831,"d":"25354"}}]
[{"$nulls":10},"DOX350",null,null,"y = 53174x-0.192",{"$f":"53174*($O$11^-0.192)","v":{"v":14115.59961524873,"d":"14116"}},{"$f":"53174*($P$11^-0.192)","v":{"v":34174.2766806152,"d":"34174"}}]
[{"$nulls":10},"DOX390",null,null,"y = 74256x-0.194",{"$f":"74256*($O$11^-0.194)","v":{"v":19441.579745830895,"d":"19442"}},{"$f":"74256*($P$11^-0.194)","v":{"v":47504.149943599514,"d":"47504"}}]
[{"$nulls":10},"DOX440",null,null,"y = 89385x-0.193",{"$f":"89385*($O$11^-0.193)","v":{"v":23564.848092200158,"d":"23565"}},{"$f":"89385*($P$11^-0.193)","v":{"v":57314.51800306467,"d":"57315"}}]
[{"$nulls":10},"DOX490",null,null,"y = 153385x-0.193",{"$f":"153385*($O$11^-0.193)","v":{"v":40437.36896148259,"d":"40437"}},{"$f":"153385*($P$11^-0.193)","v":{"v":98351.93090451501,"d":"98352"}}]
[{"$nulls":10},"DOX550",null,null,"y = 254454x-0.193",{"$f":"254454*($O$11^-0.193)","v":{"v":67082.50664488113,"d":"67083"}},{"$f":"254454*($P$11^-0.193)","v":{"v":163158.34160040072,"d":"163158"}}]
[{"$nulls":10},"DOX625",null,null,"y = 386151.45x-0.19",{"$f":"386151.45*($O$11^-0.19)","v":{"v":103934.00672618444,"d":"103934"}},{"$f":"386151.45*($O$11^-0.19)","v":{"v":103934.00672618444,"d":"103934"}}]

{"sheet":"Daves pad 6 (Shikar mod)","index":4,"n_rows":67,"n_cols":35,"rows_kept":67,"hidden":true,"merged":[[1,17,2,17],[2,19,2,21],[3,6,3,9],[3,11,3,13],[3,19,3,21]]}
["Daves scratchpad 6"]
[{"$nulls":11},{"$f":"1.25^3","v":1.953125},{"$nulls":5},"Agreed by team"]
["Proposal to use unfactored POWER values to define couplings",{"$nulls":18},"Dave - Initial Calc"]
[null,null,"Power  kW at MSF 1",{"$nulls":3},"Power kW at MSF 1.25",{"$nulls":4},"TORQUE Nm",{"$nulls":3},"ACTIVE\nCELL",null,"Max Speed",null,"Power kW at MSF 1.25"]
[null,null,"1000 rpm","1500 rpm ","3000 rpm","max rpm","1000 rpm","1500 rpm ","3000 rpm","max rpm","3000 rpm",1000,1500,3000,"max",{"$nulls":4},"1000 rpm","1500 rpm ","3000 rpm"]
["BJ095 - R","TCAE-R-1",{"$f":"1000*L6/9549","v":{"v":24.05559810019482,"d":"24"}},{"$f":"1500*M6/9549","v":{"v":33.218865907594925,"d":"33"}},{"$f":"3000*N6/9549","v":{"v":57.677267619335986,"d":"58"}},null,{"$f":"+C6/$L$2","v":{"v":12.316466227299749,"d":"12"}},{"$f":"IF(R6>=1500,+D6/$L$2,\"-\")","v":{"v":17.0080593446886,"d":"17"}},{"$f":"IF(R6>=3000,+E6/$L$2,\"-\")","v":{"v":29.530761021100023,"d":"30"}},"-",null,{"v":229.70690625876034,"d":"230"},{"v":211.4713003677493,"d":"211"},{"v":183.58674283234643,"d":"184"},null,{"$f":"Formulae!$O$29","v":{"v":229.70690625876034,"d":"230"}},null,{"$f":"Formulae!I19","v":3600},null,{"v":12.288,"d":"12"},{"v":16.128,"d":"16"},{"v":25.6,"d":"26"}]
["BJ125 - R","TCAE-R-2",{"$f":"1000*L7/9549","v":{"v":58.93190424545409,"d":"59"}},{"$f":"1500*M7/9549","v":{"v":82.00962964962442,"d":"82"}},{"$f":"3000*N7/9549","v":{"v":144.2793898760666,"d":"144"}},null,{"v":30.173134973672497,"d":"30"},{"$f":"IF(R7>=1500,+D7/$L$2,\"-\")","v":{"v":41.9889303806077,"d":"42"}},{"$f":"IF(R7>=3000,+E7/$L$2,\"-\")","v":{"v":73.87104761654611,"d":"74"}},"-",null,{"v":562.740753639841,"d":"563"},{"v":522.073302349509,"d":"522"},{"v":459.24129797552,"d":"459"},null,{"$f":"Formulae!$O$32","v":{"v":562.740753639841,"d":"563"}},null,{"$f":"Formulae!I20","v":3600},null,{"v":29.081599999999998,"d":"29"},{"v":38.144,"d":"38"},{"v":59.904,"d":"60"}]
["BJ150 - R","TCAE-R-3",{"v":96.15775757599357,"d":"96"},{"v":132.94782688183076,"d":"133"},{"v":231.31522008843336,"d":"231"},null,{"v":49.23277187890871,"d":"49"},{"$f":"IF(R8>=1500,+D8/$L$2,\"-\")","v":{"v":68.06928736349735,"d":"68"}},{"v":118.43339268527788,"d":"118"},"-",null,{"v":918.2104270931626,"d":"918"},{"v":846.3458659297346,"d":"846"},{"v":736.2763455414835,"d":"736"},null,{"$f":"Formulae!$O$35","v":{"v":918.2104270931626,"d":"918"}},null,{"$f":"Formulae!I21","v":3000},null,{"v":49.664,"d":"50"},{"v":65.024,"d":"65"},{"v":103.424,"d":"103"}]
["BJ175 - R","TCAE-R-4",{"v":150.8367591480214,"d":"151"},{"v":207.87170516536662,"d":"208"},{"v":359.6748781460473,"d":"360"},null,{"v":77.22842068378695,"d":"77"},{"v":106.43031304466771,"d":"106"},{"v":184.15353761077623,"d":"184"},"-",null,{"v":1440.3402131044563,"d":"1440"},{"v":1323.3112750827238,"d":"1323"},{"v":1144.8451371388687,"d":"1145"},null,{"$f":"Formulae!$O$38","v":{"v":1440.3402131044563,"d":"1440"}},null,{"$f":"Formulae!I22","v":3000},null,{"v":78.848,"d":"79"},{"v":103.424,"d":"103"},{"v":163.84,"d":"164"}]
["BJ200 - R","TCAE-R-5",{"v":242.30578010218596,"d":"242"},{"v":336.5097825902474,"d":"337"},{"v":589.9728013948522,"d":"590"},null,{"v":124.06055941231921,"d":"124"},{"v":172.2930086862067,"d":"172"},{"$f":"IF(R10>=3000,+E10/$L$2,\"-\")","v":{"v":302.0660743141643,"d":"302"}},"-",null,{"v":2313.7778941957736,"d":"2314"},{"v":2142.2212759695153,"d":"2142"},{"v":1877.8834268398145,"d":"1878"},null,{"$f":"Formulae!$O$41","v":{"v":2313.7778941957736,"d":"2314"}},null,{"$f":"Formulae!I23","v":3000},null,{"v":118.272,"d":"118"},{"v":153.6,"d":"154"},{"v":245.76,"d":"246"}]
["BJ225 - R","TCAE-R-6",{"$f":"1000*L11/9549","v":{"v":325.1589504648646,"d":"325"}},{"v":449.74746106912016,"d":"450"},{"$f":"3000*N11/9549","v":{"v":783.0558111494487,"d":"783"}},{"$f":"R11*O11/9549","v":{"v":719.7583707694419,"d":"720"}},{"v":166.48138263801067,"d":"166"},{"v":230.27070006738953,"d":"230"},"-",{"$f":"F11/$L$2","v":{"v":368.5162858339542,"d":"369"}},{"$f":"+E11/$L$2","v":{"v":400.9245753085177,"d":"401"}},{"v":3104.942817988992,"d":"3105"},{"v":2863.0923371660188,"d":"2863"},{"v":2492.4666468886953,"d":"2492"},{"v":2545.5454379545927,"d":"2546"},{"$f":"Formulae!$O$44","v":{"v":3104.942817988992,"d":"3105"}},null,{"$f":"Formulae!I24","v":2700},null,{"v":168.96,"d":"169"},{"v":220.16,"d":"220"},{"v":348.16,"d":"348"}]
["BJ250 - R","TCAE-R-7",{"v":468.9531021990287,"d":"469"},{"v":652.8597291679155,"d":"653"},{"v":1149.3713223849104,"d":"1149"},{"$f":"R12*O12/9549","v":{"v":925.3357202260048,"d":"925"}},{"v":240.1039883259027,"d":"240"},{"v":334.2641813339727,"d":"334"},"-",{"$f":"F12/$L$2","v":{"v":473.7718887557145,"d":"474"}},{"v":588.4781170610742,"d":"588"},{"v":4478.033172898526,"d":"4478"},{"v":4156.10503588295,"d":"4156"},{"v":3658.44891915117,"d":"3658"},{"v":3841.752518451356,"d":"3842"},{"$f":"Formulae!$O$47","v":{"v":4478.033172898526,"d":"4478"}},null,{"$f":"Formulae!I25","v":2300},null,{"v":230.4,"d":"230"},{"v":302.08,"d":"302"},{"v":478.72,"d":"479"}]
["BJ300 - R","TCAE-R-8",{"v":617.7741141204925,"d":"618"},{"v":862.8372859107958,"d":"863"},{"v":1527.4873436870762,"d":"1527"},{"v":1093.6501655470952,"d":"1094"},{"v":316.3003464296922,"d":"316"},{"v":441.77269038632744,"d":"442"},"-",{"$f":"F13/$L$2","v":{"v":559.9488847601127,"d":"560"}},{"v":782.073519967783,"d":"782"},{"v":5899.125015736584,"d":"5899"},{"v":5492.822162108126,"d":"5493"},{"v":4861.992214955963,"d":"4862"},{"v":5221.632715404606,"d":"5222"},{"$f":"Formulae!$O$50","v":{"v":5899.125015736584,"d":"5899"}},null,{"$f":"Formulae!I26","v":2000},null,{"v":304.64,"d":"305"},{"v":399.36,"d":"399"},{"v":634.88,"d":"635"}]
[{"$nulls":18},"max speed based on length"]
["BJ095 - R","TCAE-L-1",{"$f":"1000*L15/9549","v":{"v":24.05559810019482,"d":"24"}},{"$f":"1500*M15/9549","v":{"v":33.218865907594925,"d":"33"}},{"$f":"3000*N15/9549","v":{"v":57.677267619335986,"d":"58"}},null,{"$f":"+C15/$L$2","v":{"v":12.316466227299749,"d":"12"}},{"v":17.0080593446886,"d":"17"},{"v":29.530761021100023,"d":"30"},"-",null,{"$f":"L6","v":{"v":229.70690625876034,"d":"230"}},{"$f":"M6","v":{"v":211.4713003677493,"d":"211"}},{"v":183.58674283234643,"d":"184"},{"$nulls":3},{"$f":"R6","v":3600},{"$f":"MROUND(-0.4667*('Model tables'!$C$13)+R15,10)","v":3600},{"$nulls":4},{"$f":"-0.4667*('Model tables'!$C$13)+R15","v":{"v":3600,"d":"3600.00"}}]
["BJ125 - R","TCAE-L-2",{"$f":"1000*L16/9549","v":{"v":58.93190424545409,"d":"59"}},{"$f":"1500*M16/9549","v":{"v":82.00962964962442,"d":"82"}},{"$f":"3000*N16/9549","v":{"v":144.2793898760666,"d":"144"}},null,{"$f":"+C16/$L$2","v":{"v":30.173134973672497,"d":"30"}},{"v":41.9889303806077,"d":"42"},{"v":73.87104761654611,"d":"74"},"-",null,{"$f":"L7","v":{"v":562.740753639841,"d":"563"}},{"v":522.073302349509,"d":"522"},{"v":459.24129797552,"d":"459"},{"$nulls":3},{"$f":"R7","v":3600},{"$f":"MROUND(-0.4667*('Model tables'!$C$13)+R16,10)","v":3600},{"$nulls":4},{"$f":"-0.4667*('Model tables'!$C$13)+R16","v":{"v":3600,"d":"3600.00"}},{"$nulls":9},500,1000]
["BJ150 - R","TCAE-L-3",{"v":96.15775757599357,"d":"96"},{"v":132.94782688183076,"d":"133"},{"v":231.31522008843336,"d":"231"},null,{"v":49.23277187890871,"d":"49"},{"v":68.06928736349735,"d":"68"},{"v":118.43339268527788,"d":"118"},"-",null,{"$f":"L8","v":{"v":918.2104270931626,"d":"918"}},{"v":846.3458659297346,"d":"846"},{"v":736.2763455414835,"d":"736"},{"$nulls":3},3000,{"$f":"MROUND(-0.4667*('Model tables'!$C$13)+R17,10)","v":3000},{"$nulls":4},{"$f":"-0.4667*('Model tables'!$C$13)+R17","v":{"v":3000,"d":"3000.00"}},{"$nulls":9},1000]
["BJ175 - R","TCAE-L-4",{"v":150.8367591480214,"d":"151"},{"v":207.87170516536662,"d":"208"},{"v":359.6748781460473,"d":"360"},null,{"v":77.22842068378695,"d":"77"},{"v":106.43031304466771,"d":"106"},{"v":184.15353761077623,"d":"184"},"-",null,{"$f":"L9","v":{"v":1440.3402131044563,"d":"1440"}},{"v":1323.3112750827238,"d":"1323"},{"v":1144.8451371388687,"d":"1145"},{"$nulls":3},3000,{"$f":"MROUND(-0.4667*('Model tables'!$C$13)+R18,10)","v":3000},{"$nulls":4},{"$f":"-0.4667*('Model tables'!$C$13)+R18","v":{"v":3000,"d":"3000.00"}},{"$nulls":9},1500]
["BJ200 - R","TCAE-L-5",{"v":242.30578010218596,"d":"242"},{"v":336.5097825902474,"d":"337"},{"v":589.9728013948522,"d":"590"},null,{"v":124.06055941231921,"d":"124"},{"v":172.2930086862067,"d":"172"},{"v":302.0660743141643,"d":"302"},"-",null,{"$f":"L10","v":{"v":2313.7778941957736,"d":"2314"}},{"v":2142.2212759695153,"d":"2142"},{"v":1877.8834268398145,"d":"1878"},{"$nulls":3},3000,{"$f":"MROUND(-0.4667*('Model tables'!$C$13)+R19,10)","v":3000},{"$nulls":4},{"$f":"-0.4667*('Model tables'!$C$13)+R19","v":{"v":3000,"d":"3000.00"}},{"$nulls":9},2000,300]
["BJ225 - R","TCAE-L-6",{"v":325.1589504648646,"d":"325"},{"v":449.74746106912016,"d":"450"},{"v":783.0558111494487,"d":"783"},{"$f":"R20*O20/9549","v":{"v":719.7583707694419,"d":"720"}},{"v":166.48138263801067,"d":"166"},{"v":230.27070006738953,"d":"230"},{"$f":"IF(R20>=3000,+E20/$L$2,\"-\")","v":"-"},{"$f":"F20/$L$2","v":{"v":368.5162858339542,"d":"369"}},null,{"$f":"L11","v":{"v":3104.942817988992,"d":"3105"}},{"v":2863.0923371660188,"d":"2863"},{"v":2492.4666468886953,"d":"2492"},{"$f":"O11","v":{"v":2545.5454379545927,"d":"2546"}},null,null,2700,{"$f":"MROUND(-0.4667*('Model tables'!$C$13)+R20,10)","v":2700},{"$nulls":4},{"$f":"-0.4667*('Model tables'!$C$13)+R20","v":{"v":2700,"d":"2700.00"}}]
["BJ250 - R","TCAE-L-7",{"v":468.9531021990287,"d":"469"},{"v":652.8597291679155,"d":"653"},{"v":1149.3713223849104,"d":"1149"},{"$f":"R21*O21/9549","v":{"v":925.3357202260048,"d":"925"}},{"v":240.1039883259027,"d":"240"},{"v":334.2641813339727,"d":"334"},"-",{"v":473.7718887557145,"d":"474"},{"$f":"+E21/$L$2","v":{"v":588.4781170610742,"d":"588"}},{"$f":"L12","v":{"v":4478.033172898526,"d":"4478"}},{"v":4156.10503588295,"d":"4156"},{"v":3658.44891915117,"d":"3658"},{"$f":"O12","v":{"v":3841.752518451356,"d":"3842"}},null,null,2300,{"$f":"MROUND(-0.4667*('Model tables'!$C$13)+R21,10)","v":2300},{"$nulls":4},{"$f":"-0.4667*('Model tables'!$C$13)+R21","v":{"v":2300,"d":"2300.00"}}]
["BJ300 - R","TCAE-L-8",{"v":617.7741141204925,"d":"618"},{"v":862.8372859107958,"d":"863"},{"v":1527.4873436870762,"d":"1527"},{"v":1093.6501655470952,"d":"1094"},{"v":316.3003464296922,"d":"316"},{"v":441.77269038632744,"d":"442"},"-",{"v":559.9488847601127,"d":"560"},{"$f":"+E22/$L$2","v":{"v":782.073519967783,"d":"782"}},{"$f":"L13","v":{"v":5899.125015736584,"d":"5899"}},{"v":5492.822162108126,"d":"5493"},{"v":4861.992214955963,"d":"4862"},{"$f":"O13","v":{"v":5221.632715404606,"d":"5222"}},null,null,{"$f":"R13","v":2000},{"$f":"MROUND(-0.4667*('Model tables'!$C$13)+R22,10)","v":2000},{"$nulls":4},{"$f":"-0.4667*('Model tables'!$C$13)+R22","v":{"v":2000,"d":"2000.00"}}]
["DOJ350 - CM","TCAE-L-9",{"$f":"1000*L23/9549","v":{"v":787.0938757858938,"d":"787"}},{"v":1092.6582818043407,"d":"1093"},{"v":1914.3336276094867,"d":"1914"},{"v":1151.2233752069292,"d":"1151"},{"$f":"+C23/$L$2","v":{"v":402.99206440237765,"d":"403"}},{"v":559.4410402838224,"d":"559"},"-",{"v":589.4263681059477,"d":"589"},{"v":980.1388173360572,"d":"980"},{"$f":"L30","v":{"v":7515.959419879499,"d":"7516"}},{"$f":"M30","v":{"v":6955.862621966433,"d":"6956"}},{"v":6093.323936680997,"d":"6093"},{"$f":"O30","v":{"v":6870.645006156855,"d":"6871"}},null,null,{"$f":"R30","v":1600},{"$f":"MROUND(-0.4667*('Model tables'!$C$13)+R23,10)","v":1600},{"$nulls":4},{"$f":"-0.4667*('Model tables'!$C$13)+R23","v":{"v":1600,"d":"1600.00"}}]
["DOJ400 - CM","TCAE-L-10",{"v":1153.3824109722466,"d":"1153"},{"v":1599.2003602892664,"d":"1599"},{"v":2795.9735294348857,"d":"2796"},{"v":1424.989506057159,"d":"1425"},{"v":590.5317944177903,"d":"591"},{"$f":"IF(R24>=1500,+D24/$L$2,\"-\")","v":"-"},"-",{"v":729.5946271012654,"d":"730"},{"v":1431.5384470706615,"d":"1432"},{"$f":"L31","v":{"v":11013.648642373983,"d":"11014"}},{"v":10180.50949360147,"d":"10181"},{"v":8899.58374419124,"d":"8900"},{"$f":"O31","v":{"v":10467.095994876778,"d":"10467"}},null,null,{"$f":"R31","v":1300},{"$f":"MROUND(-0.4667*('Model tables'!$C$13)+R24,10)","v":1300},{"$nulls":4},{"$f":"-0.4667*('Model tables'!$C$13)+R24","v":{"v":1300,"d":"1300.00"}}]
["DOJ450 - CM","TCAE-L-11",{"v":1640.1686831255595,"d":"1640"},{"v":2274.1445716850644,"d":"2274"},{"v":3976.017128578777,"d":"3976"},{"v":1899.8031335577516,"d":"1900"},{"v":839.7663657602865,"d":"840"},"-","-",{"v":972.6992043815688,"d":"973"},{"v":2035.7207698323339,"d":"2036"},{"$f":"L32","v":{"v":15661.970755165969,"d":"15662"}},{"v":14477.20434334712,"d":"14477"},{"v":12655.662520266247,"d":"12656"},{"$f":"O32","v":{"v":15117.68343528581,"d":"15118"}},null,null,1200,{"$f":"MROUND(-0.4667*('Model tables'!$C$13)+R25,10)","v":1200},{"$nulls":4},{"$f":"-0.4667*('Model tables'!$C$13)+R25","v":{"v":1200,"d":"1200.00"}}]
["DOJ500 - CM","TCAE-L-12",{"v":2267.3995991588754,"d":"2267"},{"v":3145.0945901523164,"d":"3145"},{"v":5502.561663305934,"d":"5503"},{"v":2448.6795961250486,"d":"2449"},{"v":1160.9085947693443,"d":"1,161"},"-","-",{"v":1253.723953216025,"d":"1,254"},{"v":2817.3115716126385,"d":"2817"},{"$f":"L33","v":{"v":21651.3987723681,"d":"21651"}},{"v":20021.672160909646,"d":"20022"},{"v":17514.65377430279,"d":"17515"},{"$f":"O33","v":{"v":21256.76496672554,"d":"21257"}},null,null,1100,{"$f":"MROUND(-0.4667*('Model tables'!$C$13)+R26,10)","v":1100},{"$nulls":4},{"$f":"-0.4667*('Model tables'!$C$13)+R26","v":{"v":1100,"d":"1100.00"}}]
["DOJ550 - CM","TCAE-L-13",{"v":3028.316232573194,"d":"3028"},{"v":4200.556886342218,"d":"4201"},{"v":7349.166336584817,"d":"7349"},{"v":3028.316232573194,"d":"3028"},{"v":1550.4979110774755,"d":"1,550"},"-","-",{"v":1550.4979110774755,"d":"1,550"},{"v":3762.7731643314264,"d":"3763"},{"$f":"L34","v":{"v":28917.39170484143,"d":"28917"}},{"v":26740.745138454557,"d":"26741"},{"v":23392.396449349475,"d":"23392"},{"$f":"O34","v":{"v":28917.39170484143,"d":"28917"}},null,null,1000,{"$f":"MROUND(-0.4667*('Model tables'!$C$13)+R27,10)","v":1000},{"$nulls":4},{"$f":"-0.4667*('Model tables'!$C$13)+R27","v":{"v":1000,"d":"1000.00"}}]
["DOJ625 - CM","TCAE-L-14",{"v":4262.82830626868,"d":"4263"},{"v":5912.940202409538,"d":"5913"},{"v":10345.100009734024,"d":"10345"},{"v":3560.3398925133283,"d":"3560"},{"v":2182.568092809564,"d":"2,183"},"-","-",{"v":1822.8940249668242,"d":"1,823"},{"v":5296.69120498382,"d":"5297"},{"$f":"L35","v":{"v":40705.74749655962,"d":"40706"}},{"v":37641.777328539116,"d":"37642"},{"v":32928.4533309834,"d":"32928"},{"$f":"O35","v":{"v":42497.10704201221,"d":"42497"}},null,null,800,{"$f":"MROUND(-0.4667*('Model tables'!$C$13)+R28,10)","v":800},{"$nulls":4},{"$f":"-0.4667*('Model tables'!$C$13)+R28","v":{"v":800,"d":"800.00"}}]
[]
["DOJ350 - CM","TCAE-CM-9",{"$f":"1000*L30/9549","v":{"v":787.0938757858938,"d":"787"}},{"$f":"1500*M30/9549","v":{"v":1092.6582818043407,"d":"1093"}},{"$f":"3000*N30/9549","v":{"v":1914.3336276094867,"d":"1914"}},{"$f":"R30*O30/9549","v":{"v":1151.2233752069292,"d":"1151"}},{"$f":"+C30/$L$2","v":{"v":402.99206440237765,"d":"403"}},{"v":559.4410402838224,"d":"559"},"-",{"$f":"F30/$L$2","v":{"v":589.4263681059477,"d":"589"}},{"v":980.1388173360572,"d":"980"},{"v":7515.959419879499,"d":"7516"},{"v":6955.862621966433,"d":"6956"},{"v":6093.323936680997,"d":"6093"},{"v":6870.645006156855,"d":"6871"},{"$f":"Formulae!$O$77","v":{"v":7515.959419879499,"d":"7516"}},null,{"$f":"Formulae!I35","v":1600},{"$f":"MROUND(-0.4667*('Model tables'!$C$13)+R30,10)","v":1600},{"v":399.872,"d":"400"},{"v":522.24,"d":"522"},{"v":834.56,"d":"835"}]
["DOJ400 - CM","TCAE-CM-10",{"v":1153.3824109722466,"d":"1153"},{"v":1599.2003602892664,"d":"1599"},{"v":2795.9735294348857,"d":"2796"},{"v":1424.989506057159,"d":"1425"},{"v":590.5317944177903,"d":"591"},"-","-",{"$f":"F31/$L$2","v":{"v":729.5946271012654,"d":"730"}},{"v":1431.5384470706615,"d":"1432"},{"v":11013.648642373983,"d":"11014"},{"v":10180.50949360147,"d":"10181"},{"v":8899.58374419124,"d":"8900"},{"v":10467.095994876778,"d":"10467"},{"$f":"Formulae!$O$80","v":{"v":11013.648642373983,"d":"11014"}},null,{"$f":"Formulae!I36","v":1300},{"$f":"MROUND(-0.4667*('Model tables'!$C$13)+R31,10)","v":1300},{"v":593.92,"d":"594"},{"v":778.24,"d":"778"},{"v":1239.04,"d":"1239"}]
["DOJ450 - CM","TCAE-CM-11",{"v":1640.1686831255595,"d":"1640"},{"v":2274.1445716850644,"d":"2274"},{"v":3976.017128578777,"d":"3976"},{"v":1899.8031335577516,"d":"1900"},{"v":839.7663657602865,"d":"840"},"-","-",{"$f":"F32/$L$2","v":{"v":972.6992043815688,"d":"973"}},{"v":2035.7207698323339,"d":"2036"},{"v":15661.970755165969,"d":"15662"},{"v":14477.20434334712,"d":"14477"},{"v":12655.662520266247,"d":"12656"},{"v":15117.68343528581,"d":"15118"},{"$f":"Formulae!$O$83","v":{"v":15661.970755165969,"d":"15662"}},null,{"$f":"Formulae!I37","v":1200},{"$f":"MROUND(-0.4667*('Model tables'!$C$13)+R32,10)","v":1200},{"v":844.8,"d":"845"},{"v":1111.04,"d":"1111"},{"v":1761.28,"d":"1761"}]
["DOJ500 - CM","TCAE-CM-12",{"v":2267.3995991588754,"d":"2267"},{"v":3145.0945901523164,"d":"3145"},{"v":5502.561663305934,"d":"5503"},{"v":2448.6795961250486,"d":"2449"},{"v":1160.9085947693443,"d":"1,161"},"-","-",{"v":1253.723953216025,"d":"1,254"},{"v":2817.3115716126385,"d":"2817"},{"v":21651.3987723681,"d":"21651"},{"v":20021.672160909646,"d":"20022"},{"v":17514.65377430279,"d":"17515"},{"v":21256.76496672554,"d":"21257"},{"$f":"Formulae!$O$86","v":{"v":21651.3987723681,"d":"21651"}},null,{"$f":"Formulae!I38","v":1100},{"$f":"MROUND(-0.4667*('Model tables'!$C$13)+R33,10)","v":1100},{"v":1162.24,"d":"1162"},{"v":1525.76,"d":"1526"},{"v":2421.76,"d":"2422"}]
["DOJ550 - CM","TCAE-CM-13",{"v":3028.316232573194,"d":"3028"},{"v":4200.556886342218,"d":"4201"},{"v":7349.166336584817,"d":"7349"},{"v":3028.316232573194,"d":"3028"},{"v":1550.4979110774755,"d":"1,550"},"-","-",{"v":1550.4979110774755,"d":"1,550"},{"v":3762.7731643314264,"d":"3763"},{"v":28917.39170484143,"d":"28917"},{"v":26740.745138454557,"d":"26741"},{"v":23392.396449349475,"d":"23392"},{"v":28917.39170484143,"d":"28917"},{"$f":"Formulae!$O$89","v":{"v":28917.39170484143,"d":"28917"}},null,{"$f":"Formulae!I39","v":1000},{"$f":"MROUND(-0.4667*('Model tables'!$C$13)+R34,10)","v":1000},{"v":1556.48,"d":"1556"},{"v":2037.76,"d":"2038"},{"v":3230.72,"d":"3231"}]
["DOJ625 - CM","TCAE-CM-14",{"v":4262.82830626868,"d":"4263"},{"v":5912.940202409538,"d":"5913"},{"v":10345.100009734024,"d":"10345"},{"v":3560.3398925133283,"d":"3560"},{"v":2182.568092809564,"d":"2,183"},"-","-",{"v":1822.8940249668242,"d":"1,823"},{"v":5296.69120498382,"d":"5297"},{"v":40705.74749655962,"d":"40706"},{"v":37641.777328539116,"d":"37642"},{"v":32928.4533309834,"d":"32928"},{"v":42497.10704201221,"d":"42497"},{"$f":"Formulae!$O$92","v":{"v":40705.74749655962,"d":"40706"}},null,{"$f":"Formulae!I40","v":800},{"$f":"MROUND(-0.4667*('Model tables'!$C$13)+R35,10)","v":800},{"v":2191.36,"d":"2191"},{"v":2867.2,"d":"2867"},{"v":4551.68,"d":"4552"}]
[]
["DOJ100","TCAE-S-1",{"$f":"1000*L37/9549","v":{"v":26.786509681337325,"d":"27"}},{"$f":"1500*M37/9549","v":{"v":37.38205249950917,"d":"37"}},{"$f":"3000*N37/9549","v":{"v":66.08605074396739,"d":"66"}},null,{"$f":"+C37/$L$2","v":{"v":13.71469295684471,"d":"14"}},{"v":19.139610879748695,"d":"19"},{"v":33.836057980911306,"d":"34"},"-",null,{"v":255.78438094709014,"d":"256"},{"v":237.9741462118754,"d":"238"},{"v":210.35189951804819,"d":"210"},null,{"$f":"Formulae!$O$53","v":{"v":255.78438094709014,"d":"256"}},null,{"$f":"Formulae!I27","v":3000},null,{"v":13.670399999999999,"d":"14"},{"v":18.2784,"d":"18"},{"v":29.696,"d":"30"}]
["DOJ125","TCAE-S-2",{"$f":"1000*L38/9549","v":{"v":53.94760782160168,"d":"54"}},{"$f":"1500*M38/9549","v":{"v":75.22583622060635,"d":"75"}},{"v":132.8041420607986,"d":"133"},null,{"$f":"+C38/$L$2","v":{"v":27.62117520466006,"d":"28"}},{"$f":"IF(R38>=1500,+D38/$L$2,\"-\")","v":{"v":38.515628144950455,"d":"39"}},{"v":67.99572073512888,"d":"68"},"-",null,{"v":515.1457070884744,"d":"515"},{"v":478.88767338038,"d":"479"},{"v":422.7155841795219,"d":"423"},null,{"$f":"Formulae!$O$56","v":{"v":515.1457070884744,"d":"515"}},null,{"$f":"Formulae!I28","v":3000},null,{"v":27.648,"d":"28"},{"v":37.12,"d":"37"},{"v":59.904,"d":"60"}]
["DOJ150","TCAE-S-3",{"v":94.09106388781616,"d":"94"},{"v":131.25604162502324,"d":"131"},{"v":231.88087433052155,"d":"232"},{"$f":"R39*O39/9549","v":{"v":199.64439698996125,"d":"200"}},{"v":48.17462471056187,"d":"48"},{"v":67.2030933120119,"d":"67"},"-",{"$f":"F39/$L$2","v":{"v":102.21793125886016,"d":"102"}},{"v":118.72300765722703,"d":"119"},{"v":898.4755690647565,"d":"898"},{"v":835.575960984898,"d":"836"},{"v":738.0768229940501,"d":"738"},{"v":762.561738742856,"d":"763"},{"$f":"Formulae!$O$59","v":{"v":898.4755690647565,"d":"898"}},null,{"$f":"Formulae!I29","v":2500},null,{"v":47.872,"d":"48"},64,{"v":103.936,"d":"104"}]
["DOJ175","TCAE-S-4",{"v":143.33481679536732,"d":"143"},{"v":198.8187512473825,"d":"199"},{"v":347.84722913762124,"d":"348"},{"v":300.25433244762144,"d":"300"},{"v":73.38742619922806,"d":"73"},{"$f":"IF(R40>=1500,+D40/$L$2,\"-\")","v":{"v":101.79520063865984,"d":"102"}},"-",{"v":153.73021821318218,"d":"154"},{"v":178.09778131846207,"d":"178"},{"v":1368.7041655789626,"d":"1369"},{"v":1265.680170440837,"d":"1266"},{"v":1107.1977303450485,"d":"1107"},{"v":1146.8514482169348,"d":"1147"},{"$f":"Formulae!$O$62","v":{"v":1368.7041655789626,"d":"1369"}},null,{"$f":"Formulae!I30","v":2500},null,{"v":73.728,"d":"74"},{"v":96.256,"d":"96"},{"v":153.088,"d":"153"}]
["DOJ200","TCAE-S-5",{"$f":"1000*L41/9549","v":{"v":234.6994775463562,"d":"235"}},{"$f":"1500*M41/9549","v":{"v":325.550051881657,"d":"326"}},{"v":569.572451200747,"d":"570"},{"$f":"R41*O41/9549","v":{"v":491.64282992800617,"d":"492"}},{"$f":"+C41/$L$2","v":{"v":120.16613250373437,"d":"120"}},{"$f":"IF(R41>=1500,+D41/$L$2,\"-\")","v":{"v":166.68162656340837,"d":"167"}},"-",{"$f":"F41/$L$2","v":{"v":251.72112892313916,"d":"252"}},{"v":291.62109501478244,"d":"292"},{"v":2241.1453110901557,"d":"2241"},{"v":2072.4516302786283,"d":"2072"},{"v":1812.9491121719777,"d":"1813"},{"v":1877.8789531930124,"d":"1878"},{"$f":"Formulae!$O$65","v":{"v":2241.1453110901557,"d":"2241"}},null,{"$f":"Formulae!I31","v":2500},null,{"v":120.32,"d":"120"},{"v":157.696,"d":"158"},{"v":250.368,"d":"250"}]
["DOJ225","TCAE-S-6",{"v":242.78875491620474,"d":"243"},{"v":336.7706336016106,"d":"337"},{"v":589.2036390847394,"d":"589"},{"$f":"R42*O42/9549","v":{"v":458.73689570638805,"d":"459"}},{"v":124.30784251709683,"d":"124"},{"$f":"IF(R42>=1500,+D42/$L$2,\"-\")","v":{"v":172.42656440402462,"d":"172"}},"-",{"$f":"F42/$L$2","v":{"v":234.87329060167067,"d":"235"}},{"v":301.67226321138656,"d":"302"},{"v":2318.3898206948393,"d":"2318"},{"v":2143.881853507853,"d":"2144"},{"v":1875.4351832067255,"d":"1875"},{"v":1991.1266441364996,"d":"1991"},{"$f":"Formulae!O68","v":{"v":2318.3898206948393,"d":"2318"}},null,{"$f":"Formulae!I32","v":2200},null,{"v":124.416,"d":"124"},{"v":163.328,"d":"163"},{"v":260.096,"d":"260"}]
["DOJ250","TCAE-S-7",{"v":375.90535940409023,"d":"376"},{"v":520.9931115233638,"d":"521"},{"v":910.2509223722286,"d":"910"},{"$f":"R43*O43/9549","v":{"v":656.7614668104738,"d":"657"}},{"$f":"+C43/$L$2","v":{"v":192.4635440148942,"d":"192"}},{"v":266.74847309996227,"d":"267"},"-",{"$f":"F43/$L$2","v":{"v":336.2618710069626,"d":"336"}},{"v":466.04847225458104,"d":"466"},{"v":3589.5202769496577,"d":"3590"},{"v":3316.6421479577343,"d":"3317"},{"v":2897.3286859108034,"d":"2897"},{"v":3135.707623286607,"d":"3136"},{"$f":"Formulae!O71","v":{"v":3589.5202769496577,"d":"3590"}},null,{"$f":"Formulae!I33","v":2000},null,{"v":195.072,"d":"195"},{"v":255.488,"d":"255"},{"v":405.504,"d":"406"}]
["DOJ300","TCAE-S-8",{"v":493.2295961341639,"d":"493"},{"v":683.8780792384257,"d":"684"},{"$f":"3000*N44/9549","v":{"v":1195.6631916750857,"d":"1196"}},{"v":792.1342062407596,"d":"792"},{"v":252.5335532206919,"d":"253"},{"v":350.14557657007396,"d":"350"},"-",{"$f":"F44/$L$2","v":{"v":405.5727135952689,"d":"406"}},{"v":612.1795541376439,"d":"612"},{"v":4709.849413485132,"d":"4710"},{"v":4353.567852431818,"d":"4354"},{"v":3805.7959391017976,"d":"3806"},{"v":4202.27196410723,"d":"4202"},{"$f":"Formulae!O74","v":{"v":4709.849413485132,"d":"4710"}},null,{"$f":"Formulae!I34","v":1800},null,{"v":252.928,"d":"253"},{"v":331.776,"d":"332"},{"v":527.36,"d":"527"}]
["DOJ350","TCAE-S-9",{"v":787.0938757858938,"d":"787"},{"v":1092.6582818043407,"d":"1093"},{"v":1914.3336276094867,"d":"1914"},{"v":1151.2233752069292,"d":"1151"},{"v":402.99206440237765,"d":"403"},{"v":559.4410402838224,"d":"559"},"-",{"v":589.4263681059477,"d":"589"},{"v":980.1388173360572,"d":"980"},{"v":7515.959419879499,"d":"7516"},{"v":6955.862621966433,"d":"6956"},{"v":6093.323936680997,"d":"6093"},{"v":6870.645006156855,"d":"6871"},{"$f":"Formulae!O77","v":{"v":7515.959419879499,"d":"7516"}},null,{"$f":"Formulae!I35","v":1600},null,{"v":399.872,"d":"400"},{"v":522.24,"d":"522"},{"v":834.56,"d":"835"}]
["DOJ400","TCAE-S-10",{"v":1153.3824109722466,"d":"1153"},{"$f":"1500*M46/9549","v":{"v":1599.2003602892664,"d":"1599"}},{"v":2795.9735294348857,"d":"2796"},{"$f":"R46*O46/9549","v":{"v":1424.989506057159,"d":"1425"}},{"$f":"+C46/$L$2","v":{"v":590.5317944177903,"d":"591"}},"-","-",{"$f":"F46/$L$2","v":{"v":729.5946271012654,"d":"730"}},{"v":1431.5384470706615,"d":"1432"},{"v":11013.648642373983,"d":"11014"},{"v":10180.50949360147,"d":"10181"},{"v":8899.58374419124,"d":"8900"},{"v":10467.095994876778,"d":"10467"},{"$f":"Formulae!O80","v":{"v":11013.648642373983,"d":"11014"}},null,{"$f":"Formulae!I36","v":1300},null,{"v":593.92,"d":"594"},{"v":778.24,"d":"778"},{"v":1239.04,"d":"1239"}]
["DOJ450","TCAE-S-11",{"v":1640.1686831255595,"d":"1640"},{"v":2274.1445716850644,"d":"2274"},{"v":3976.017128578777,"d":"3976"},{"v":1899.8031335577516,"d":"1900"},{"v":839.7663657602865,"d":"840"},"-","-",{"v":972.6992043815688,"d":"973"},{"v":2035.7207698323339,"d":"2036"},{"v":15661.970755165969,"d":"15662"},{"v":14477.20434334712,"d":"14477"},{"v":12655.662520266247,"d":"12656"},{"v":15117.68343528581,"d":"15118"},{"$f":"Formulae!O83","v":{"v":15661.970755165969,"d":"15662"}},null,{"$f":"Formulae!I37","v":1200},null,{"v":844.8,"d":"845"},{"v":1111.04,"d":"1111"},{"v":1761.28,"d":"1761"}]
["DOJ500","TCAE-S-12",{"v":2267.3995991588754,"d":"2267"},{"v":3145.0945901523164,"d":"3145"},{"v":5502.561663305934,"d":"5503"},{"v":2448.6795961250486,"d":"2449"},{"v":1160.9085947693443,"d":"1,161"},"-","-",{"v":1253.723953216025,"d":"1,254"},{"v":2817.3115716126385,"d":"2817"},{"v":21651.3987723681,"d":"21651"},{"v":20021.672160909646,"d":"20022"},{"v":17514.65377430279,"d":"17515"},{"v":21256.76496672554,"d":"21257"},{"$f":"Formulae!O86","v":{"v":21651.3987723681,"d":"21651"}},null,{"$f":"Formulae!I38","v":1100},null,{"v":1162.24,"d":"1162"},{"v":1525.76,"d":"1526"},{"v":2421.76,"d":"2422"}]
["DOJ550","TCAE-S-13",{"v":3028.316232573194,"d":"3028"},{"v":4200.556886342218,"d":"4201"},{"v":7349.166336584817,"d":"7349"},{"v":3028.316232573194,"d":"3028"},{"v":1550.4979110774755,"d":"1,550"},"-","-",{"v":1550.4979110774755,"d":"1,550"},{"v":3762.7731643314264,"d":"3763"},{"v":28917.39170484143,"d":"28917"},{"v":26740.745138454557,"d":"26741"},{"v":23392.396449349475,"d":"23392"},{"v":28917.39170484143,"d":"28917"},{"$f":"Formulae!O89","v":{"v":28917.39170484143,"d":"28917"}},null,{"$f":"Formulae!I39","v":1000},null,{"v":1556.48,"d":"1556"},{"v":2037.76,"d":"2038"},{"v":3230.72,"d":"3231"}]
["DOJ625","TCAE-S-14",{"$f":"1000*L50/9549","v":{"v":4262.82830626868,"d":"4263"}},{"$f":"1500*M50/9549","v":{"v":5912.940202409538,"d":"5913"}},{"$f":"3000*N50/9549","v":{"v":10345.100009734024,"d":"10345"}},{"$f":"R50*O50/9549","v":{"v":3560.3398925133283,"d":"3560"}},{"v":2182.568092809564,"d":"2,183"},"-","-",{"v":1822.8940249668242,"d":"1,823"},{"v":5296.69120498382,"d":"5297"},{"v":40705.74749655962,"d":"40706"},{"v":37641.777328539116,"d":"37642"},{"v":32928.4533309834,"d":"32928"},{"v":42497.10704201221,"d":"42497"},{"$f":"Formulae!O92","v":{"v":40705.74749655962,"d":"40706"}},null,{"$f":"Formulae!I40","v":800},null,{"v":2191.36,"d":"2191"},{"v":2867.2,"d":"2867"},{"v":4551.68,"d":"4552"}]
[{"$nulls":16},"catalogue","suggested"]
["BC75P_A","TCAE-V-00",{"$f":"1000*L52/9549","v":{"v":11.298672207977775,"d":"11"}},{"$f":"1500*M52/9549","v":{"v":15.659607511445461,"d":"16"}},{"$f":"3000*N52/9549","v":{"v":27.35961736538448,"d":"27"}},null,{"$f":"+C52/$L$2","v":{"v":5.784920170484621,"d":"6"}},{"v":8.017719045860076,"d":"8"},{"$f":"IF(R52>=3000,+E52/$L$2,\"-\")","v":{"v":14.008124091076853,"d":"14"}},"-",null,{"v":107.89102091397979,"d":"108"},{"v":99.68906141786181,"d":"100"},{"v":87.0856620740188,"d":"87"},null,{"$f":"Formulae!O15","v":{"v":107.89102091397979,"d":"108"}},2500,{"$f":"Formulae!I12","v":3000},null,{"v":5.784314419681429,"d":"6"},{"v":8.016879494127526,"d":"8"},{"v":14.006657271800293,"d":"14"}]
["DOX87F","TCAE-V-0",{"$f":"1000*L53/9549","v":{"v":17.513073040724443,"d":"18"}},{"$f":"1500*M53/9549","v":{"v":24.262733682073655,"d":"24"}},{"$f":"3000*N53/9549","v":{"v":42.361160353519715,"d":"42"}},{"$f":"R53*O53/9549","v":{"v":30.57669037142173,"d":"31"}},{"$f":"+C53/$L$2","v":{"v":8.966693396850914,"d":"9"}},{"v":12.422519645221712,"d":"12"},{"$f":"IF(R53>=3000,+E53/$L$2,\"-\")","v":"-"},{"$f":"F53/$L$2","v":{"v":15.655265470167926,"d":"16"}},{"v":21.688914101002094,"d":"22"},{"v":167.2323344658777,"d":"167"},{"v":154.4565626200809,"d":"154"},{"v":134.83557340525326,"d":"135"},{"v":145.98840817835304,"d":"146"},{"$f":"Formulae!O17","v":{"v":167.2323344658777,"d":"167"}},2000,{"$f":"Formulae!I13","v":2000},"*",{"v":8.965754476076375,"d":"9"},{"v":12.421218857824305,"d":"12"},{"v":21.686643010520314,"d":"22"}]
["DOX100F","TCAE-V-1",{"v":25.723528586216,"d":"26"},{"v":35.623109270812186,"d":"36"},{"$f":"3000*N54/9549","v":{"v":62.15254398290623,"d":"62"}},{"$f":"R54*O54/9549","v":{"v":41.23959234614752,"d":"41"}},{"v":13.170446636142591,"d":"13"},{"v":18.23903194665584,"d":"18"},"-",{"v":21.11467128122753,"d":"21"},{"v":31.82210251924799,"d":"32"},{"v":245.63397446977655,"d":"246"},{"v":226.77671361799037,"d":"227"},{"v":197.83154749759052,"d":"198"},{"v":218.7760373963126,"d":"219"},{"$f":"Formulae!O19","v":{"v":245.63397446977655,"d":"246"}},1800,{"$f":"Formulae!I14","v":1800},"*",{"v":13.169067531782785,"d":"13"},{"v":18.237122100378702,"d":"18"},{"v":31.818770361916133,"d":"32"}]
["DOX125F","TCAE-V-2",{"v":51.403833091648515,"d":"51"},{"v":71.38869196880525,"d":"71"},{"v":125.15947163424556,"d":"125"},{"$f":"R55*O55/9549","v":{"v":71.38869196880525,"d":"71"}},{"v":26.31876254292404,"d":"26"},{"v":36.55101028802829,"d":"37"},"-",{"v":36.55101028802829,"d":"37"},{"v":64.08164947673373,"d":"64"},{"v":490.8552021921517,"d":"491"},{"v":454.46041307341426,"d":"454"},{"v":398.3825982118036,"d":"398"},{"v":454.46041307341426,"d":"454"},{"$f":"Formulae!O21","v":{"v":490.8552021921517,"d":"491"}},1500,{"$f":"Formulae!I15","v":1500},null,{"v":26.316006651558286,"d":"26"},{"v":36.54718295710808,"d":"37"},{"v":64.07493935636967,"d":"64"}]
["DOX150F","TCAE-V-3",{"v":87.5653652036222,"d":"88"},{"v":121.31366841036827,"d":"121"},{"v":211.80580176759855,"d":"212"},{"v":101.38975768541474,"d":"101"},{"v":44.83346698425457,"d":"45"},"-","-",{"v":51.911555934932345,"d":"52"},{"v":108.44457050501046,"d":"108"},{"v":836.1616723293885,"d":"836"},{"v":772.2828131004044,"d":"772"},{"v":674.1778670262662,"d":"674"},{"v":806.8089967816878,"d":"807"},{"$f":"Formulae!O23","v":{"v":836.1616723293885,"d":"836"}},1200,{"$f":"Formulae!I16","v":1200},"*",{"v":44.82877238038187,"d":"45"},{"v":62.10609428912153,"d":"62"},{"v":108.43321505260157,"d":"108"}]
["DOX175F","TCAE-V-4",{"v":133.5264858088246,"d":"134"},{"v":184.76364345997516,"d":"185"},{"v":321.91524511126903,"d":"322"},{"$f":"R57*O57/9549","v":{"v":133.5264858088246,"d":"134"}},{"v":68.36556073411819,"d":"68"},"-","-",{"v":68.36556073411819,"d":"68"},{"v":164.82060549696973,"d":"165"},{"v":1275.044412988466,"d":"1275"},{"v":1176.205354266202,"d":"1176"},{"v":1024.6562251891694,"d":"1025"},{"v":1275.044412988466,"d":"1275"},{"$f":"Formulae!O25","v":{"v":1275.044412988466,"d":"1275"}},1000,{"$f":"Formulae!I17","v":1000},"*",{"v":68.35840203665911,"d":"68"},{"v":94.58907979858043,"d":"95"},{"v":164.80334679482348,"d":"165"}]
["DOX200F","TCAE-V-5",{"v":225.965454054687,"d":"226"},{"v":312.67355187499714,"d":"313"},{"v":544.7737509758259,"d":"545"},{"v":225.965454054687,"d":"226"},{"v":115.69431247599974,"d":"116"},"-","-",{"v":115.69431247599974,"d":"116"},{"v":278.9241604996229,"d":"279"},{"v":2157.7441207682064,"d":"2158"},{"v":1990.4798312362318,"d":"1990"},{"v":1734.014849356054,"d":"1734"},{"v":2157.7441207682064,"d":"2158"},{"$f":"Formulae!O27","v":{"v":2157.7441207682064,"d":"2158"}},1000,{"$f":"Formulae!I18","v":1000},"*",{"v":115.68219788830592,"d":"116"},{"v":160.0720953287357,"d":"160"},{"v":278.894953781246,"d":"279"}]
["DOX225F","TCAE-V-6",{"v":392.012455203001,"d":"392"},{"v":543.7578151591164,"d":"544"},{"v":951.342104999342,"d":"951"},{"$f":"R59*O59/9549","v":{"v":740.6874212116219,"d":"741"}},{"v":200.71037706393653,"d":"201"},{"v":278.4040013614676,"d":"278"},"-",{"v":379.2319596603504,"d":"379"},{"v":487.0871577596631,"d":"487"},{"v":3743.326934733457,"d":"3743"},{"v":3461.5622513029343,"d":"3462"},{"v":3028.121920212906,"d":"3028"},{"v":3214.92008415899,"d":"3215"},{"$f":"Formulae!O104","v":{"v":3743.326934733457,"d":"3743"}},null,{"$f":"Formulae!$E$45","v":2200},null,{"v":200.6893602705267,"d":"201"},{"v":278.3748491100161,"d":"278"},{"v":487.0361538687983,"d":"487"}]
["DOX250F","TCAE-V-7",{"v":524.0913048185485,"d":"524"},{"v":726.9634907504404,"d":"727"},{"v":1271.87317270248,"d":"1272"},{"v":916.9341777497585,"d":"917"},{"v":268.3347480670968,"d":"268"},{"v":372.2053072642255,"d":"372"},"-",{"v":469.47029900787635,"d":"469"},{"v":651.1990644236697,"d":"651"},{"v":5004.547869712319,"d":"5005"},{"v":4627.849582117304,"d":"4628"},{"v":4048.3723087119934,"d":"4048"},{"v":4377.902231666222,"d":"4378"},{"$f":"Formulae!O105","v":{"v":5004.547869712319,"d":"5005"}},null,{"$f":"Formulae!$E$46","v":2000},null,{"v":268.30665018771805,"d":"268"},{"v":372.1663328865015,"d":"372"},{"v":651.1308760399604,"d":"651"}]
["DOX300F","TCAE-V-8",{"$f":"1000*L61/9549","v":{"v":1073.0739176109164,"d":"1073"}},{"v":1487.8501521571109,"d":"1488"},{"v":2601.293586780134,"d":"2601"},{"v":1723.3729740199349,"d":"1723"},{"$f":"+C61/$L$2","v":{"v":549.4138458167891,"d":"549"}},{"v":761.7792779044407,"d":"762"},"-",{"v":882.3669626982066,"d":"882"},{"v":1331.8623164314286,"d":"1332"},{"v":10246.782839266642,"d":"10247"},{"v":9471.654068632168,"d":"9472"},{"v":8279.917486721166,"d":"8280"},{"v":9142.493627175754,"d":"9142"},{"$f":"Formulae!O107","v":{"v":10246.782839266642,"d":"10247"}},null,{"$f":"Formulae!$E$48","v":1800},null,{"v":380.7187916098937,"d":"381"},{"v":527.878371405203,"d":"528"},{"v":922.9199729189501,"d":"923"},"*changed from DOX285 to DOX300"]
["DOX350F","TCAE-V-9",{"v":1478.2280464183402,"d":"1478"},{"v":2051.2716376760486,"d":"2051"},{"v":3591.330812938733,"d":"3591"},{"v":2161.077709774761,"d":"2161"},{"v":756.8527597661902,"d":"757"},{"v":1050.251078490137,"d":"1,050"},"-",{"v":1106.4717874046776,"d":"1,106"},{"v":1838.7613762246312,"d":"1839"},{"v":14115.59961524873,"d":"14116"},{"v":13058.395245445725,"d":"13058"},{"v":11431.205977583988,"d":"11431"},{"v":12897.581906649495,"d":"12898"},{"$f":"Formulae!O109","v":{"v":14115.59961524873,"d":"14116"}},null,{"$f":"Formulae!$E$50","v":1600},null,{"v":756.7735081683089,"d":"757"},{"v":1050.1411045552163,"d":"1050"},{"v":1838.5688357663878,"d":"1839"}]
["DOX390F","TCAE-V-10",{"v":2035.98070434924,"d":"2036"},{"v":2822.9501724347397,"d":"2823"},{"v":4935.525374452452,"d":"4936"},{"v":2515.42863029003,"d":"2515"},{"v":1042.422120626811,"d":"1,042"},"-","-",{"v":1287.8994587084953,"d":"1,288"},{"v":2526.988991719655,"d":"2527"},{"v":19441.579745830895,"d":"19442"},{"v":17970.900797719554,"d":"17971"},{"v":15709.777266882154,"d":"15710"},{"v":18476.79076203038,"d":"18477"},{"$f":"Formulae!O110","v":{"v":19441.579745830895,"d":"19442"}},null,{"$f":"Formulae!$E$51","v":1300},null,{"v":1042.3129664780542,"d":"1042"},{"v":1445.1991426857192,"d":"1445"},{"v":2526.7243855425118,"d":"2527"}]
["DOX440F","TCAE-V-11",{"v":2467.781766907546,"d":"2468"},{"v":3423.04333460086,"d":"3423"},{"v":5988.852317442509,"d":"5989"},{"v":2858.9464229791934,"d":"2859"},{"v":1263.5042646566637,"d":"1,264"},"-","-",{"v":1463.780568565347,"d":"1,464"},{"v":3066.2923865305647,"d":"3066"},{"v":23564.848092200158,"d":"23565"},{"v":21791.093868069074,"d":"21791"},{"v":19062.516926419506,"d":"19063"},{"v":22750.06616085693,"d":"22750"},{"$f":"Formulae!O111","v":{"v":23564.848092200158,"d":"23565"}},null,{"$f":"Formulae!$E$52","v":1200},null,{"v":1263.371960545181,"d":"1263"},{"v":1752.4146691808428,"d":"1752"},{"v":3065.9713087937553,"d":"3066"}]
["DOX490F","TCAE-V-12",{"v":4234.722898888113,"d":"4235"},{"v":5873.95538264533,"d":"5874"},{"v":10276.89335694937,"d":"10277"},{"v":4573.291607530296,"d":"4573"},{"v":2168.1781242307143,"d":"2,168"},"-","-",{"v":2341.5253030555114,"d":"2,342"},{"v":5261.769398758077,"d":"5262"},{"v":40437.36896148259,"d":"40437"},{"v":37393.59996592018,"d":"37394"},{"v":32711.35155516984,"d":"32711"},{"v":39700.328691188,"d":"39700"},{"$f":"Formulae!O112","v":{"v":40437.36896148259,"d":"40437"}},null,{"$f":"Formulae!$E$53","v":1100},null,{"v":2167.951089872156,"d":"2168"},{"v":3007.1502380970364,"d":"3007"},{"v":5261.218428140405,"d":"5261"}]
["DOX550F","TCAE-V-13",{"v":7025.081856202862,"d":"7025"},{"v":9744.44334801731,"d":"9744"},{"v":17048.58116666685,"d":"17049"},{"v":7025.081856202862,"d":"7025"},{"v":3596.841910375865,"d":"3,597"},"-","-",{"v":3596.841910375865,"d":"3,597"},{"v":8728.873557333427,"d":"8729"},{"v":67082.50664488113,"d":"67083"},{"v":62033.12635347819,"d":"62033"},{"v":54265.63385350058,"d":"54266"},{"v":67082.50664488113,"d":"67083"},{"$f":"Formulae!O113","v":{"v":67082.50664488113,"d":"67083"}},null,{"$f":"Formulae!$E$54","v":1000},null,{"v":3596.465277715093,"d":"3596"},{"v":4988.632569578142,"d":"4989"},{"v":8727.959539159883,"d":"8728"}]
["DOX625F","TCAE-V-14",{"v":10884.281780938783,"d":"10884"},{"v":15115.889081185229,"d":"15116"},{"v":26501.34970269112,"d":"26501"},{"$f":"R67*O67/9549","v":{"v":9084.534238874254,"d":"9085"}},{"v":5572.752271840657,"d":"5,573"},"-","-",{"v":4651.281530303618,"d":"4,651"},{"v":13568.691047777855,"d":"13569"},{"v":103934.00672618444,"d":"103934"},{"v":96227.74989082517,"d":"96228"},{"v":84353.79610366584,"d":"84354"},{"v":108435.2718087628,"d":"108435"},{"$f":"Formulae!O114","v":{"v":103934.00672618444,"d":"103934"}},null,{"$f":"Formulae!$E$55","v":800},null,{"v":5572.168737571354,"d":"5572"},{"v":7738.524807974213,"d":"7739"},{"v":13567.270242432536,"d":"13567"}]

{"sheet":"Shikar scratchpad 5","index":5,"n_rows":109,"n_cols":28,"rows_kept":109,"hidden":true,"merged":[[1,1,1,11],[3,1,3,6],[4,2,4,3],[4,5,4,7],[4,18,4,27],[30,1,30,7],[31,2,31,3],[31,4,31,17],[41,17,49,17],[69,20,69,21],[69,24,69,25],[70,16,70,17],[70,20,70,21],[70,24,70,25],[71,16,71,17],[71,20,71,21],[71,24,71,25],[72,16,72,17],[72,20,72,21],[72,24,72,25],[73,16,73,17],[73,20,73,21],[73,24,73,25],[74,16,74,17],[74,20,74,21],[75,16,75,17],[75,20,75,21],[76,16,76,17],[76,20,76,21],[76,24,76,25],[77,16,77,17],[77,20,77,21],[78,16,78,17],[78,20,78,21],[79,16,79,17],[79,20,79,21],[79,24,79,25],[80,16,80,17],[80,20,80,21],[81,16,81,17],[81,20,81,21],[82,16,82,17],[82,20,82,21],[83,16,83,17],[83,20,83,21],[84,1,84,6],[88,0,96,0],[100,0,108,0]]}
[null,"OBJECTIVE: "]
[2,"Determine the correlation between Service life data and strength data for BJ and DOJ to apply to BCF models"]
[]
[null,"DOX Series comparison of dynamic torque to life torques"]
[null,null,"limit",null,null,"formulas",{"$nulls":4},"Rule 1","Rule 2","Rule 3",{"$nulls":5},"rpm"]
[null,"Model","static","dyn ",null,"static ","dyn",{"$nulls":3},"static/dyn","dynn+1/dynn","dynn/dynn-1",null,"Model","static","dyn fwd","dyn rev",10,50,100,200,300,400,500,600,800,1000]
[1,"DOX225",40000,11610,null,{"$f":"C42/C7","v":{"v":0.7425,"d":"0.743"}},{"$f":"D7/D42","v":{"v":1.6125,"d":"1.613"}},{"$nulls":3},{"$f":"+D7/C7","v":{"v":0.29025,"d":"0.290"}},{"$f":"D8/D7","v":{"v":1.309216192937123,"d":"1.31"}},null,null,"DOX225",{"$nulls":3},{"$f":"$G7*E42","v":{"v":9094.5,"d":"9,095"}},{"$f":"$G7*F42","v":{"v":6691.875,"d":"6,692"}},{"v":5853.375,"d":"5,853"},{"v":5111.625,"d":"5,112"},{"v":4740.75,"d":"4,741"},{"v":4466.625,"d":"4,467"},{"v":4289.25,"d":"4,289"},{"v":4144.125,"d":"4,144"},{"v":3918.375,"d":"3,918"},{"$f":"$G7*N42","v":{"v":3741,"d":"3,741"}}]
[2,"DOX250",53200,15200,null,{"$f":"C43/C8","v":{"v":0.7894736842105263,"d":"0.789"}},{"$f":"D8/D43","v":{"v":1.3818181818181818,"d":"1.382"}},{"$nulls":3},{"v":0.2857142857142857,"d":"0.286"},{"v":1.4407894736842106,"d":"1.44"},{"$f":"D8/D7","v":{"v":1.309216192937123,"d":"1.31"}},null,"DOX250",{"$nulls":3},{"$f":"$G8*E43","v":{"v":12187.636363636364,"d":"12,188"}},{"$f":"$G8*F43","v":{"v":8940.363636363636,"d":"8,940"}},{"v":7738.181818181818,"d":"7,738"},{"v":6853.818181818182,"d":"6,854"},{"v":6356.363636363636,"d":"6,356"},{"v":5997.090909090909,"d":"5,997"},{"v":5734.545454545455,"d":"5,735"},{"v":5527.272727272727,"d":"5,527"},{"v":5250.909090909091,"d":"5,251"},{"v":4974.545454545455,"d":"4,975"}]
[3,"DOX285",76650,21900,{"$nulls":6},{"v":0.2857142857142857,"d":"0.286"},{"v":1.4429223744292237,"d":"1.443"},{"$f":"D9/D8","v":{"v":1.4407894736842106,"d":"1.441"}},null,"DOX285",{"$nulls":3},{"$f":"S10/$L$9","v":{"v":17368.96551724138,"d":"17,369"}},{"$f":"T10/$L$9","v":{"v":12686.89655172414,"d":"12,687"}},{"v":11101.03448275862,"d":"11,101"},{"v":9666.206896551725,"d":"9,666"},{"v":8911.03448275862,"d":"8,911"},{"v":8457.931034482759,"d":"8,458"},{"v":8155.862068965518,"d":"8,156"},{"v":7853.793103448275,"d":"7,854"},{"v":7400.689655172414,"d":"7,401"},{"v":7098.620689655172,"d":"7,099"}]
[4,"DOX300",110600,31600,null,{"$f":"C44/C10","v":{"v":0.569620253164557,"d":"0.570"}},{"$f":"D10/D44","v":{"v":2.179310344827586,"d":"2.179"}},{"$nulls":3},{"v":0.2857142857142857,"d":"0.286"},{"v":1.0126582278481013,"d":"1.01"},{"$f":"D10/D9","v":{"v":1.4429223744292237,"d":"1.44"}},null,"DOX300",{"$nulls":3},{"$f":"$G10*E44","v":{"v":25062.06896551724,"d":"25,062"}},{"$f":"$G10*F44","v":{"v":18306.206896551725,"d":"18,306"}},{"v":16017.931034482757,"d":"16,018"},{"v":13947.58620689655,"d":"13,948"},{"v":12857.931034482757,"d":"12,858"},{"v":12204.137931034482,"d":"12,204"},{"v":11768.275862068966,"d":"11,768"},{"v":11332.413793103447,"d":"11,332"},{"v":10678.620689655172,"d":"10,679"},{"v":10242.758620689654,"d":"10,243"}]
[5,"DOX315",112000,32000,{"$nulls":6},{"v":0.2857142857142857,"d":"0.286"},{"v":1.35625,"d":"1.36"},{"$f":"D11/D10","v":{"v":1.0126582278481013,"d":"1.01"}},null,"DOX315",{"$nulls":3},{"$f":"S10*$M$11","v":{"v":25379.310344827587,"d":"25,379"}},{"$f":"T10*$M$11","v":{"v":18537.93103448276,"d":"18,538"}},{"v":16220.689655172413,"d":"16,221"},{"v":14124.137931034482,"d":"14,124"},{"v":13020.689655172413,"d":"13,021"},{"v":12358.620689655172,"d":"12,359"},{"v":11917.241379310346,"d":"11,917"},{"v":11475.862068965516,"d":"11,476"},{"v":10813.793103448275,"d":"10,814"},{"$f":"AB10*$M$11","v":{"v":10372.413793103447,"d":"10,372"}}]
[6,"DOX350",151900,43400,null,{"$f":"C45/C12","v":{"v":0.6056616194865043,"d":"0.606"}},{"$f":"D12/D45","v":{"v":1.8869565217391304,"d":"1.887"}},{"$nulls":3},{"v":0.2857142857142857,"d":"0.286"},{"v":1.3824884792626728,"d":"1.38"},{"$f":"D12/D11","v":{"v":1.35625,"d":"1.36"}},null,"DOX350",{"$nulls":3},{"$f":"$G12*E45","v":{"v":34153.913043478264,"d":"34,154"}},{"$f":"$G12*F45","v":{"v":25096.521739130436,"d":"25,097"}},{"v":21888.695652173912,"d":"21,889"},{"v":19246.956521739132,"d":"19,247"},{"v":17737.391304347824,"d":"17,737"},{"v":16793.91304347826,"d":"16,794"},{"v":16039.130434782608,"d":"16,039"},{"v":15473.04347826087,"d":"15,473"},{"v":14718.260869565218,"d":"14,718"},{"v":14152.173913043478,"d":"14,152"}]
[7,"DOX390",210000,60000,null,{"v":0.6761904761904762,"d":"0.676"},{"$f":"D13/D46","v":{"v":1.7647058823529411,"d":"1.765"}},{"$nulls":3},{"v":0.2857142857142857,"d":"0.286"},{"v":1.6666666666666667,"d":"1.67"},{"v":1.3824884792626728,"d":"1.38"},null,"DOX390",{"$nulls":3},{"v":47470.58823529412,"d":"47,471"},{"$f":"$G13*F46","v":{"v":34941.17647058824,"d":"34,941"}},{"v":30352.941176470587,"d":"30,353"},{"v":26470.588235294115,"d":"26,471"},{"v":24705.882352941175,"d":"24,706"},{"v":23294.11764705882,"d":"23,294"},{"v":22411.764705882353,"d":"22,412"},{"v":21529.41176470588,"d":"21,529"},{"v":20294.11764705882,"d":"20,294"},{"v":19411.764705882353,"d":"19,412"}]
[8,"DOX440",350000,100000,null,{"v":0.5342857142857143,"d":"0.534"},{"$f":"D14/D48","v":{"v":1.492537313432836,"d":"1.493"}},{"$nulls":3},{"v":0.2857142857142857,"d":"0.286"},1.25,{"v":1.6666666666666667,"d":"1.67"},null,"DOX440",{"$nulls":3},{"v":57164.17910447762,"d":"57,164"},{"$f":"$G14*F47","v":{"v":41940.29850746269,"d":"41,940"}},{"v":36716.417910447766,"d":"36,716"},{"v":32089.552238805973,"d":"32,090"},{"v":29701.492537313436,"d":"29,701"},{"v":28059.701492537315,"d":"28,060"},{"v":26865.671641791047,"d":"26,866"},{"v":25970.149253731346,"d":"25,970"},{"v":24477.61194029851,"d":"24,478"},{"v":23432.835820895525,"d":"23,433"}]
[9,"DOX490",437500,125000,null,{"v":0.5942857142857143,"d":"0.594"},{"$f":"D15/D48","v":{"v":1.8656716417910448,"d":"1.866"}},{"$nulls":3},{"v":0.2857142857142857,"d":"0.286"},{"v":1.648,"d":"1.65"},1.25,null,"DOX490",{"$nulls":3},{"v":98320.89552238806,"d":"98,321"},{"$f":"$G15*F48","v":{"v":72201.49253731343,"d":"72,201"}},{"v":63059.701492537315,"d":"63,060"},{"v":55223.880597014926,"d":"55,224"},{"v":51119.40298507463,"d":"51,119"},{"v":48134.32835820896,"d":"48,134"},{"v":46268.656716417914,"d":"46,269"},{"v":44776.119402985074,"d":"44,776"},{"v":42164.17910447761,"d":"42,164"},{"v":40485.07462686567,"d":"40,485"}]
[10,"DOX550",721000,206000,null,{"v":0.47572815533980584,"d":"0.476"},{"$f":"D16/D49","v":{"v":2.3146067415730336,"d":"2.315"}},{"$nulls":3},{"v":0.2857142857142857,"d":"0.286"},{"v":1.4077669902912622,"d":"1.41"},{"v":1.648,"d":"1.65"},null,"DOX550",{"$nulls":3},{"v":162948.31460674157,"d":"162,948"},{"$f":"$G16*F49","v":{"v":119433.70786516853,"d":"119,434"}},{"v":104620.22471910111,"d":"104,620"},{"v":91426.96629213482,"d":"91,427"},{"v":84483.14606741573,"d":"84,483"},{"v":80085.39325842696,"d":"80,085"},{"v":76613.48314606742,"d":"76,613"},{"v":74067.41573033707,"d":"74,067"},{"v":69438.202247191,"d":"69,438"},{"v":67123.59550561798,"d":"67,124"}]
[11,"DOX625",1015000,290000,null,{"v":0.6088669950738916,"d":"0.609"},{"$f":"D17/D50","v":{"v":2.5,"d":"2.500"}},{"$nulls":3},{"v":0.2857142857142857,"d":"0.286"},0,{"v":1.4077669902912622,"d":"1.41"},null,"DOX625",{"$nulls":3},{"v":247500,"d":"247,500"},{"$f":"$G17*F50","v":{"v":181750,"d":"181,750"}},{"v":159000,"d":"159,000"},{"v":139000,"d":"139,000"},{"v":128500,"d":"128,500"},{"v":121750,"d":"121,750"},{"v":116500,"d":"116,500"},{"v":112500,"d":"112,500"},{"v":106500,"d":"106,500"},{"v":101750,"d":"101,750"}]
{"$rows_empty":13}
[null,"DOJ Series comparison of dynamic torque to life torques"]
[null,null,"limit",null,"rpm"]
[null,"Model","static","dyn",10,50,100,200,300,400,500,600,800,1000,1500,2000,3000,4000]
[null,"DOJ68",1090,275,180,130,118,104,97,93,89,87,81,78,69,61,56,49]
[null,"DOJ75",1520,392,250,176,167,148,137,132,125,122,110,110,98,88,79,69]
[null,"DOJ87",2500,640,400,284,260,230,215,205,196,190,180,172,154,137,124,108]
[null,"DOJ100",3720,880,580,420,387,343,318,303,289,284,264,255,225,200,184,160]
[null,"DOJ125",5780,1470,1180,862,784,686,637,617,588,568,540,515,460,410,370,323]
[null,"DOJ150",11560,2890,2060,1470,1370,1176,1120,1070,1030,980,930,900,800,715,647,558]
[null,"DOJ175",15680,4010,3330,2440,2130,1870,730,1630,560,1520,1430,1370,1190,1080,950,860]
[null,"DOJ200",23900,5880,5450,3990,3500,3050,2830,2670,2560,2480,2350,2240,1960,1781,1558,1410]
[null,"DOJ225",29700,7200,5640,4150,3630,3170,2940,2770,2660,2570,2430,2320,2020,1870,1640]
[null,"DOJ250",42000,11000,8820,6470,5600,4960,4600,4340,4150,4000,3800,3600,3180,2920,2550]
[null,"DOJ300",63000,14500,11500,8400,7350,6400,5900,5600,5400,5200,4900,4700,4120,3800,3330]
[null,"DOJ350",92000,23000,18100,13300,11600,10200,9400,8900,8500,8200,7800,7500,6520,6020,5260]
[null,"DOJ400",142000,34000,26900,19800,17200,15000,14000,13200,12700,12200,11500,11000,9690,8900,7830]
[null,"DOJ450",187000,49000,38300,28100,24600,21500,19900,18800,18000,17400,16400,15700,13800,12700,11100]
[null,"DOJ500",260000,67000,52700,38700,33800,29600,27400,25800,24800,24000,22600,21700,19300,17500,15300]
[null,"DOJ550",343000,89000,70400,51600,45200,39500,36500,34600,33100,32000,30000,29000,25700,23400,20400]
[null,"DOJ625",618000,116000,99000,72700,63600,55600,51400,48700,46600,45000,42600,40700,36300,33000,28800]
{"$rows_empty":18}
[{"$nulls":13},"Correlation Summary",null,null,"R2 coeff"]
[{"$nulls":13},"torque at rpm","Dynamic Rev","Static","Linear equation Dynamic Rev",{"$nulls":3},"inverse equation for dynamic reverse",{"$nulls":3},"inverse equation for dynamic Rev"]
[{"$nulls":13},10,0.9976,0.9809,"1.2135x + 466.27",{"$nulls":3},"(y-466.27)/1.2135",{"$nulls":3},"(y-32.667)/1.0617"]
[{"$nulls":13},50,0.9976,null,"1.653x + 478.84",{"$nulls":3},"(y-478.84)/1.653",{"$nulls":3},"(y-37.583)/1.6591"]
[{"$nulls":13},100,0.9976,0.981,"1.8899x + 477.35",{"$nulls":3},"(y-477.35)/1.8899",{"$nulls":3},"(y-60.951)/2.2429"]
[{"$nulls":13},200,0.9976,null,"2.1597x + 538.33",{"$nulls":3},"(y-538.33)/2.1597",{"$nulls":3},"(y-49.256)/2.5724"]
[{"$nulls":13},300,0.9976,null,"2.3299x + 713.64",{"$nulls":3},"(y-643.72)/2.3321"]
[{"$nulls":13},400,0.9976,null,"2.4675x + 533.71",{"$nulls":3},"(y-463.5)/2.4698"]
[{"$nulls":13},500,0.9975,0.9805,"2.5698x + 735.4",{"$nulls":3},"(y-735.4)/2.5698",{"$nulls":3},"(y-24.918)/3.2564"]
[{"$nulls":13},600,0.9977,null,"2.6676x + 520.47",{"$nulls":3},"(y-450.2)/2.6702"]
[{"$nulls":13},800,0.9973,null,"2.8271x + 527.28",{"$nulls":3},"(y-527.28)/2.8271"]
[{"$nulls":13},1000,0.9977,0.9807,"2.9485x +520.95",{"$nulls":3},"(y-520.95)/2.9485",{"$nulls":3},"(y-43.836)/4.1051"]
[{"$nulls":13},1500,0.9973,null,"3.3127x + 653.13",{"$nulls":3},"(y-653.13)/3.3127"]
[{"$nulls":13},2000,0.9975,0.98,"3.6421x + 577.43",{"$nulls":3},"(y-577.43)/3.6421"]
[{"$nulls":13},3000,0.9975,0.9814,"4.1744x + 526.93",{"$nulls":3},"(y-526.93)/4.1744"]
[{"$nulls":13},4000,0.9913,0.9814,"4.1933x + 200.65",{"$nulls":3},"(y-200.65)/4.1933"]
[null,"BCF Series comparison of dynamic torque to life torques",{"$nulls":11},"AVG",{"$f":"AVERAGE(O71:O83)","v":{"v":0.9975461538461539,"d":"0.9975"}},{"$f":"AVERAGE(P71:P83)","v":{"v":0.98075,"d":"0.9808"}}]
[]
[{"$nulls":4},"rpm"]
[null,"Model","Static Nm","dyn rev",10,50,100,200,300,400,500,600,800,1000,1500,2000,3000]
["Correlation with DOJ data","BC225F",16170,4753,{"$f":"+(D89-466.27)/1.2135","v":{"v":3532.533992583436,"d":"3533"}},{"$f":"+(D89-478.84)/1.653","v":{"v":2585.698729582577,"d":"2586"}},{"$f":"+(D89-477.35)/1.8899","v":{"v":2262.3683792793267,"d":"2262"}},{"$f":"+(D89-538.33)/2.1597","v":{"v":1951.5071537713573,"d":"1952"}},{"$f":"+(D89-713.64)/2.3299","v":{"v":1733.70530924074,"d":"1734"}},{"$f":"+(D89-533.71)/2.4675","v":{"v":1709.9452887537996,"d":"1710"}},{"$f":"+(D89-735.4)/2.5698","v":{"v":1563.3901470931592,"d":"1563"}},{"$f":"+(D89-520.47)/2.6676","v":{"v":1586.6434248013193,"d":"1587"}},{"$f":"+(D89-527.28)/2.8271","v":{"v":1494.7189699692265,"d":"1495"}},{"$f":"+(D89-520.95)/2.9585","v":{"v":1430.4715227311137,"d":"1430"}},{"$f":"+(D89-653.13)/3.3127","v":{"v":1237.6218794336946,"d":"1238"}},{"$f":"+(D89-577.43)/3.6421","v":{"v":1146.4731885450701,"d":"1146"}},{"$f":"+(D89-526.93)/4.1744","v":{"v":1012.3778267535453,"d":"1012"}}]
[null,"BC240F",22187,6527,{"$f":"+(D90-466.27)/1.2135","v":{"v":4994.421096003296,"d":"4994"}},{"$f":"+(D90-478.84)/1.653","v":{"v":3658.898971566848,"d":"3659"}},{"$f":"+(D90-477.35)/1.8899","v":{"v":3201.042383194878,"d":"3201"}},{"$f":"+(D90-538.33)/2.1597","v":{"v":2772.9175348428025,"d":"2773"}},{"$f":"+(D90-713.64)/2.3299","v":{"v":2495.1113781707368,"d":"2495"}},{"$f":"+(D90-533.71)/2.4675","v":{"v":2428.8915906788247,"d":"2429"}},{"$f":"+(D90-665.53)/2.5723","v":{"v":2278.6883333981264,"d":"2279"}},{"$f":"+(D90-520.47)/2.6676","v":{"v":2251.660668765932,"d":"2252"}},{"$f":"+(D90-527.28)/2.8271","v":{"v":2122.2171129425915,"d":"2122"}},{"$f":"+(D90-520.95)/2.9585","v":{"v":2030.0997126922427,"d":"2030"}},{"$f":"+(D90-653.13)/3.3127","v":{"v":1773.1367162737345,"d":"1773"}},{"$f":"+(D90-577.43)/3.6421","v":{"v":1633.5548172757474,"d":"1634"}},{"$f":"+(D90-526.93)/4.1744","v":{"v":1437.3490801073206,"d":"1437"}}]
[null,"BC287F",38328,11270,{"v":8902.95014421096,"d":"8903"},{"v":6528.227465214761,"d":"6528"},{"v":5710.698978781947,"d":"5711"},{"v":4969.055887391767,"d":"4969"},{"v":4530.8210652817725,"d":"4531"},{"v":4351.08004052685,"d":"4351"},{"v":4122.563464603662,"d":"4123"},{"v":4029.6633678212625,"d":"4030"},{"v":3799.908032966644,"d":"3800"},{"v":3633.276998478959,"d":"3633"},{"v":3204.8993268330973,"d":"3205"},{"v":2935.825485296944,"d":"2936"},{"$f":"+(D91-526.93)/4.1744","v":{"v":2573.5602721349173,"d":"2574"}}]
[null,"BC350F",60868,17905,{"v":14370.605686032139,"d":"14371"},{"v":10542.141560798547,"d":"10542"},{"v":9221.466744272186,"d":"9221"},{"v":8041.241839144325,"d":"8041"},{"v":7378.582771792781,"d":"7379"},{"v":7040.036474164134,"d":"7040"},{"v":6701.967111145668,"d":"6702"},{"v":6516.917828759933,"d":"6517"},{"v":6146.835980333204,"d":"6147"},{"v":5875.96755112388,"d":"5876"},{"v":5207.797265070788,"d":"5208"},{"v":4757.57667279866,"d":"4758"},{"$f":"+(D92-526.93)/4.1744","v":{"v":4163.010252970486,"d":"4163"}}]
[null,"BC410F",90856,26725,{"v":21638.838071693448,"d":"21639"},{"v":15877.894736842105,"d":"15878"},{"v":13888.380337584,"d":"13888"},{"v":12125.142380886233,"d":"12125"},{"v":11164.152967938538,"d":"11164"},{"v":10614.504559270517,"d":"10615"},{"v":10130.805116044008,"d":"10131"},{"v":9823.260608786923,"d":"9823"},{"v":9266.640727247002,"d":"9267"},{"v":8857.208044617204,"d":"8857"},{"v":7870.278020949679,"d":"7870"},{"v":7179.256472913978,"d":"7179"},{"$f":"+(D93-526.93)/4.1744","v":{"v":6275.88875047911,"d":"6276"}}]
[null,"BC450F",129360,38053,{"v":30973.819530284305,"d":"30974"},{"v":22730.88929219601,"d":"22731"},{"v":19882.348272395368,"d":"19882"},{"v":17370.31532157244,"d":"17370"},{"v":16026.164213056356,"d":"16026"},{"v":15205.386018237084,"d":"15205"},{"v":14534.646036620925,"d":"14535"},{"v":14069.774328984853,"d":"14070"},{"v":13273.573626684589,"d":"13274"},{"v":12686.175426736523,"d":"12686"},{"v":11289.845141425425,"d":"11290"},{"v":10289.549984898822,"d":"10290"}]
[null,"BC500F",177449,52195,{"v":42627.7132262052,"d":"42628"},{"v":31286.24319419238,"d":"31286"},{"v":27365.283877453836,"d":"27365"},{"v":23918.447006528684,"d":"23918"},{"v":22095.952615992104,"d":"22096"},{"v":20936.693009118542,"d":"20937"},{"v":20032.449558760643,"d":"20032"},{"v":19371.16884090568,"d":"19371"},{"v":18275.872802518483,"d":"18276"},{"v":17466.300490113234,"d":"17466"},{"v":15558.870407824434,"d":"15559"},{"v":14172.474671206171,"d":"14172"}]
[null,"BC550F",236190,69462,{"v":56856.80263700041,"d":"56857"},{"v":41732.09921355112,"d":"41732"},{"v":36501.74612413355,"d":"36502"},{"v":31913.538917442238,"d":"31914"},{"v":29507.00030044208,"d":"29507"},{"v":27934.464032421478,"d":"27934"},{"v":26745.119154064458,"d":"26745"},{"v":25844.028340080968,"d":"25844"},{"v":24383.544975416502,"d":"24384"},{"v":23302.704073009972,"d":"23303"},{"v":20771.234944305248,"d":"20771"},{"v":18913.42082864282,"d":"18913"}]
[null,"BC600F",441980,125440,{"v":102986.18046971569,"d":"102986"},{"v":75596.58802177859,"d":"75597"},{"v":66121.30271442933,"d":"66121"},{"v":57832.879566606476,"d":"57833"},{"v":53532.92415983519,"d":"53533"},{"v":50620.58358662614,"d":"50621"},{"v":48506.96652800996,"d":"48507"},{"v":46828.433798170634,"d":"46828"},{"v":44184.04725690637,"d":"44184"},{"v":42223.77894203144,"d":"42224"},{"v":37669.23355570984,"d":"37669"},{"v":34283.125120123004,"d":"34283"}]
[]
[{"$nulls":4},"rpm"]
[null,"Model","Static Nm","dyn rev",10,50,100,200,300,400,500,600,800,1000,1500,2000,3000,4000]
["Correlation with BJD data","BC225F",16170,4753,{"$f":"+(D101-32.667)/1.0617","v":{"v":4446.013939907694,"d":"4446"}},null,{"$f":"+(D101-37.583)/1.6591","v":{"v":2842.153577240673,"d":"2842"}},{"$nulls":3},{"$f":"+(D101-60.951)/2.2429","v":{"v":2091.956395737661,"d":"2092"}},null,null,{"$f":"+(D101-49.256)/2.5724","v":{"v":1828.542994868605,"d":"1829"}},null,{"$f":"+(D101-24.918)/3.2564","v":{"v":1451.9352659378455,"d":"1452"}},null,{"$f":"+(D101-43.836)/4.1051","v":{"v":1147.1496431268422,"d":"1147"}}]
[null,"BC240F",22187,6527,{"$f":"+(D102-32.667)/1.0617","v":{"v":6116.919092022227,"d":"6117"}},null,{"$f":"+(D102-37.583)/1.6591","v":{"v":3911.407992284974,"d":"3911"}},{"$nulls":3},{"$f":"+(D102-60.951)/2.2429","v":{"v":2882.896696241473,"d":"2883"}},null,null,{"v":2518.1713574871715,"d":"2518"},null,{"v":1996.7086353027883,"d":"1997"},null,{"v":1579.295023263745,"d":"1579"}]
[null,"BC287F",38328,11270,{"v":10584.282754073654,"d":"10584"},null,{"v":6770.186848291241,"d":"6770"},{"$nulls":3},{"v":4997.569664273931,"d":"4998"},null,null,{"v":4361.974809516405,"d":"4362"},null,{"v":3453.225033779634,"d":"3453"},null,{"v":2734.6870965384524,"d":"2735"}]
[null,"BC350F",60868,17905,{"v":16833.694075539228,"d":"16834"},null,{"v":10769.343017298535,"d":"10769"},{"$nulls":3},{"v":7955.793392482945,"d":"7956"},null,null,{"v":6941.278183797232,"d":"6941"},null,{"v":5490.75113622405,"d":"5491"},null,{"v":4350.9692821124945,"d":"4351"}]
[null,"BC410F",90856,26725,{"v":25141.12555335782,"d":"25141"},null,{"v":16085.478271351938,"d":"16085"},{"$nulls":3},{"v":11888.202327344063,"d":"11888"},null,null,{"v":10369.982895350644,"d":"10370"},null,{"v":8199.263603979854,"d":"8199"},null,{"v":6499.516211541741,"d":"6500"}]
[null,"BC450F",129360,38053,{"v":35810.80625412075,"d":"35811"},null,{"v":22913.276475197395,"d":"22913"},{"$nulls":3},{"v":16938.80645592759,"d":"16939"},null,null,{"v":14773.652620121287,"d":"14774"},null,{"v":11677.951725832207,"d":"11678"},null,{"v":9259.01049913522,"d":"9259"}]
[null,"BC500F",177449,52195,{"v":49130.95318828294,"d":"49131"},null,{"v":31437.174974383703,"d":"31437"},{"$nulls":3},{"v":23244.036292300145,"d":"23244"},null,null,{"v":20271.242419530397,"d":"20271"},null,{"v":16020.78430168284,"d":"16021"},null,{"v":12703.993568975176,"d":"12704"}]
[null,"BC550F",236190,69462,{"v":65394.49279457473,"d":"65394"},null,{"v":41844.624796576456,"d":"41845"},{"$nulls":3},{"v":30942.551607294125,"d":"30943"},null,null,{"v":26983.651065153168,"d":"26984"},null,{"v":21323.265569340372,"d":"21323"},null,{"v":16910.224842269374,"d":"16910"}]
[null,"BC600F",441980,125440,{"v":118119.36799472543,"d":"118119"},null,{"v":75584.60430353806,"d":"75585"},{"$nulls":3},{"v":55900.41865442061,"d":"55900"},null,null,{"v":48744.65246462448,"d":"48745"},null,{"v":38513.414199729756,"d":"38513"},null,{"v":30546.433460817032,"d":"30546"}]

{"sheet":"Shikar scratchpad 5 (Dave mod)","index":6,"n_rows":109,"n_cols":28,"rows_kept":109,"hidden":true,"merged":[[1,1,1,11],[3,1,3,6],[4,2,4,3],[4,5,4,7],[4,18,4,27],[21,16,27,16],[21,17,21,18],[21,19,21,20],[21,22,21,23],[21,24,21,25],[22,17,22,18],[22,19,22,20],[22,22,22,23],[22,24,22,25],[23,17,23,18],[23,19,23,20],[23,22,23,23],[23,24,23,25],[24,17,24,18],[24,19,24,20],[24,22,24,23],[24,24,24,25],[25,17,25,18],[25,19,25,20],[25,22,25,23],[25,24,25,25],[26,17,26,18],[26,19,26,20],[26,22,26,23],[26,24,26,25],[27,17,27,18],[27,19,27,20],[27,22,27,23],[27,24,27,25],[28,17,28,18],[30,1,30,7],[31,2,31,3],[31,4,31,17],[41,17,49,17],[69,20,69,21],[69,24,69,25],[70,16,70,17],[70,20,70,21],[70,24,70,25],[71,16,71,17],[71,20,71,21],[71,24,71,25],[72,16,72,17],[72,20,72,21],[72,24,72,25],[73,16,73,17],[73,20,73,21],[73,24,73,25],[74,16,74,17],[74,20,74,21],[75,16,75,17],[75,20,75,21],[76,16,76,17],[76,20,76,21],[76,24,76,25],[77,16,77,17],[77,20,77,21],[78,16,78,17],[78,20,78,21],[79,16,79,17],[79,20,79,21],[79,24,79,25],[80,16,80,17],[80,20,80,21],[81,16,81,17],[81,20,81,21],[82,16,82,17],[82,20,82,21],[83,16,83,17],[83,20,83,21],[84,1,84,6],[88,0,96,0],[100,0,108,0]]}
[null,"OBJECTIVE: "]
[2,"Determine the correlation between Service life data and strength data for BJ and DOJ to apply to BCF models"]
[]
[null,"DOX Series comparison of dynamic torque to life torques"]
[null,null,"limit",null,null,"formulas",{"$nulls":4},"Rule 1","Rule 2","Rule 3",{"$nulls":5},"rpm"]
[null,"Model","static","dyn ",null,"static ","dyn",{"$nulls":3},"static/dyn","dynn+1/dynn","dynn/dynn-1",null,"Model","static","dyn fwd","dyn rev",10,50,100,200,300,400,500,600,800,1000]
[1,"DOX225",40000,11610,null,{"$f":"C42/C7","v":{"v":0.7425,"d":"0.743"}},{"$f":"D7/D42","v":{"v":1.6125,"d":"1.613"}},{"$nulls":3},{"$f":"+D7/C7","v":{"v":0.29025,"d":"0.290"}},{"$f":"D8/D7","v":{"v":1.309216192937123,"d":"1.31"}},null,null,"DOX225",{"$nulls":3},{"$f":"$G7*E42","v":{"v":9094.5,"d":"9,095"}},{"$f":"$G7*F42","v":{"v":6691.875,"d":"6,692"}},{"v":5853.375,"d":"5,853"},{"v":5111.625,"d":"5,112"},{"v":4740.75,"d":"4,741"},{"v":4466.625,"d":"4,467"},{"v":4289.25,"d":"4,289"},{"v":4144.125,"d":"4,144"},{"v":3918.375,"d":"3,918"},{"$f":"$G7*N42","v":{"v":3741,"d":"3,741"}}]
[2,"DOX250",53200,15200,null,{"$f":"C43/C8","v":{"v":0.7894736842105263,"d":"0.789"}},{"$f":"D8/D43","v":{"v":1.3818181818181818,"d":"1.382"}},{"$nulls":3},{"v":0.2857142857142857,"d":"0.286"},{"v":1.4407894736842106,"d":"1.44"},{"$f":"D8/D7","v":{"v":1.309216192937123,"d":"1.31"}},null,"DOX250",{"$nulls":3},{"$f":"$G8*E43","v":{"v":12187.636363636364,"d":"12,188"}},{"v":8940.363636363636,"d":"8,940"},{"v":7738.181818181818,"d":"7,738"},{"v":6853.818181818182,"d":"6,854"},{"v":6356.363636363636,"d":"6,356"},{"v":5997.090909090909,"d":"5,997"},{"v":5734.545454545455,"d":"5,735"},{"v":5527.272727272727,"d":"5,527"},{"v":5250.909090909091,"d":"5,251"},{"v":4974.545454545455,"d":"4,975"}]
[3,"DOX285",76650,21900,{"$nulls":6},{"v":0.2857142857142857,"d":"0.286"},{"v":1.4429223744292237,"d":"1.443"},{"$f":"D9/D8","v":{"v":1.4407894736842106,"d":"1.441"}},null,"DOX285",{"$nulls":3},{"$f":"S10/$L$9","v":{"v":17368.96551724138,"d":"17,369"}},{"$f":"T10/$L$9","v":{"v":12686.89655172414,"d":"12,687"}},{"v":11101.03448275862,"d":"11,101"},{"v":9666.206896551725,"d":"9,666"},{"v":8911.03448275862,"d":"8,911"},{"v":8457.931034482759,"d":"8,458"},{"v":8155.862068965518,"d":"8,156"},{"v":7853.793103448275,"d":"7,854"},{"v":7400.689655172414,"d":"7,401"},{"v":7098.620689655172,"d":"7,099"}]
[4,"DOX300",110600,31600,null,{"$f":"C44/C10","v":{"v":0.569620253164557,"d":"0.570"}},{"$f":"D10/D44","v":{"v":2.179310344827586,"d":"2.179"}},{"$nulls":3},{"v":0.2857142857142857,"d":"0.286"},{"v":1.0126582278481013,"d":"1.01"},{"$f":"D10/D9","v":{"v":1.4429223744292237,"d":"1.44"}},null,"DOX300",{"$nulls":3},{"$f":"$G10*E44","v":{"v":25062.06896551724,"d":"25,062"}},{"$f":"$G10*F44","v":{"v":18306.206896551725,"d":"18,306"}},{"v":16017.931034482757,"d":"16,018"},{"v":13947.58620689655,"d":"13,948"},{"v":12857.931034482757,"d":"12,858"},{"v":12204.137931034482,"d":"12,204"},{"v":11768.275862068966,"d":"11,768"},{"v":11332.413793103447,"d":"11,332"},{"v":10678.620689655172,"d":"10,679"},{"v":10242.758620689654,"d":"10,243"}]
[5,"DOX315",112000,32000,{"$nulls":6},{"v":0.2857142857142857,"d":"0.286"},{"v":1.35625,"d":"1.36"},{"$f":"D11/D10","v":{"v":1.0126582278481013,"d":"1.01"}},null,"DOX315",{"$nulls":3},{"$f":"S10*$M$11","v":{"v":25379.310344827587,"d":"25,379"}},{"$f":"T10*$M$11","v":{"v":18537.93103448276,"d":"18,538"}},{"v":16220.689655172413,"d":"16,221"},{"v":14124.137931034482,"d":"14,124"},{"v":13020.689655172413,"d":"13,021"},{"v":12358.620689655172,"d":"12,359"},{"v":11917.241379310346,"d":"11,917"},{"v":11475.862068965516,"d":"11,476"},{"v":10813.793103448275,"d":"10,814"},{"$f":"AB10*$M$11","v":{"v":10372.413793103447,"d":"10,372"}}]
[6,"DOX350",151900,43400,null,{"$f":"C45/C12","v":{"v":0.6056616194865043,"d":"0.606"}},{"$f":"D12/D45","v":{"v":1.8869565217391304,"d":"1.887"}},{"$nulls":3},{"v":0.2857142857142857,"d":"0.286"},{"v":1.3824884792626728,"d":"1.38"},{"$f":"D12/D11","v":{"v":1.35625,"d":"1.36"}},null,"DOX350",{"$nulls":3},{"$f":"$G12*E45","v":{"v":34153.913043478264,"d":"34,154"}},{"v":25096.521739130436,"d":"25,097"},{"v":21888.695652173912,"d":"21,889"},{"v":19246.956521739132,"d":"19,247"},{"v":17737.391304347824,"d":"17,737"},{"v":16793.91304347826,"d":"16,794"},{"v":16039.130434782608,"d":"16,039"},{"v":15473.04347826087,"d":"15,473"},{"v":14718.260869565218,"d":"14,718"},{"v":14152.173913043478,"d":"14,152"}]
[7,"DOX390",210000,60000,null,{"v":0.6761904761904762,"d":"0.676"},{"$f":"D13/D46","v":{"v":1.7647058823529411,"d":"1.765"}},{"$nulls":3},{"v":0.2857142857142857,"d":"0.286"},{"v":1.6666666666666667,"d":"1.67"},{"v":1.3824884792626728,"d":"1.38"},null,"DOX390",{"$nulls":3},{"v":47470.58823529412,"d":"47,471"},{"v":34941.17647058824,"d":"34,941"},{"v":30352.941176470587,"d":"30,353"},{"v":26470.588235294115,"d":"26,471"},{"v":24705.882352941175,"d":"24,706"},{"v":23294.11764705882,"d":"23,294"},{"v":22411.764705882353,"d":"22,412"},{"v":21529.41176470588,"d":"21,529"},{"v":20294.11764705882,"d":"20,294"},{"v":19411.764705882353,"d":"19,412"}]
[8,"DOX440",350000,100000,null,{"v":0.5342857142857143,"d":"0.534"},{"$f":"D14/D48","v":{"v":1.492537313432836,"d":"1.493"}},{"$nulls":3},{"v":0.2857142857142857,"d":"0.286"},1.25,{"v":1.6666666666666667,"d":"1.67"},null,"DOX440",{"$nulls":3},{"v":57164.17910447762,"d":"57,164"},{"v":41940.29850746269,"d":"41,940"},{"v":36716.417910447766,"d":"36,716"},{"v":32089.552238805973,"d":"32,090"},{"v":29701.492537313436,"d":"29,701"},{"v":28059.701492537315,"d":"28,060"},{"v":26865.671641791047,"d":"26,866"},{"v":25970.149253731346,"d":"25,970"},{"v":24477.61194029851,"d":"24,478"},{"v":23432.835820895525,"d":"23,433"}]
[9,"DOX490",437500,125000,null,{"v":0.5942857142857143,"d":"0.594"},{"$f":"D15/D48","v":{"v":1.8656716417910448,"d":"1.866"}},{"$nulls":3},{"v":0.2857142857142857,"d":"0.286"},{"v":1.648,"d":"1.65"},1.25,null,"DOX490",{"$nulls":3},{"v":98320.89552238806,"d":"98,321"},{"v":72201.49253731343,"d":"72,201"},{"v":63059.701492537315,"d":"63,060"},{"v":55223.880597014926,"d":"55,224"},{"v":51119.40298507463,"d":"51,119"},{"v":48134.32835820896,"d":"48,134"},{"v":46268.656716417914,"d":"46,269"},{"v":44776.119402985074,"d":"44,776"},{"v":42164.17910447761,"d":"42,164"},{"v":40485.07462686567,"d":"40,485"}]
[10,"DOX550",721000,206000,null,{"v":0.47572815533980584,"d":"0.476"},{"$f":"D16/D49","v":{"v":2.3146067415730336,"d":"2.315"}},{"$nulls":3},{"v":0.2857142857142857,"d":"0.286"},{"v":1.4077669902912622,"d":"1.41"},{"v":1.648,"d":"1.65"},null,"DOX550",{"$nulls":3},{"v":162948.31460674157,"d":"162,948"},{"v":119433.70786516853,"d":"119,434"},{"v":104620.22471910111,"d":"104,620"},{"v":91426.96629213482,"d":"91,427"},{"v":84483.14606741573,"d":"84,483"},{"v":80085.39325842696,"d":"80,085"},{"v":76613.48314606742,"d":"76,613"},{"v":74067.41573033707,"d":"74,067"},{"v":69438.202247191,"d":"69,438"},{"v":67123.59550561798,"d":"67,124"}]
[11,"DOX625",1015000,290000,null,{"v":0.6088669950738916,"d":"0.609"},{"$f":"D17/D50","v":{"v":2.5,"d":"2.500"}},{"$nulls":3},{"v":0.2857142857142857,"d":"0.286"},0,{"v":1.4077669902912622,"d":"1.41"},null,"DOX625",{"$nulls":3},{"v":247500,"d":"247,500"},{"v":181750,"d":"181,750"},{"v":159000,"d":"159,000"},{"v":139000,"d":"139,000"},{"v":128500,"d":"128,500"},{"v":121750,"d":"121,750"},{"v":116500,"d":"116,500"},{"v":112500,"d":"112,500"},{"v":106500,"d":"106,500"},{"v":101750,"d":"101,750"}]
{"$rows_empty":13}
[null,"DOJ Series comparison of dynamic torque to life torques"]
[null,null,"limit",null,"rpm"]
["TCAE-S","Model","static","dyn",10,50,100,200,300,400,500,600,800,1000,1500,2000,3000,4000]
[null,"DOJ68",1090,275,180,130,118,104,97,93,89,87,81,78,69,61,56,49]
[null,"DOJ75",1520,392,250,176,167,148,137,132,125,122,110,110,98,88,79,69]
[null,"DOJ87",2500,640,400,284,260,230,215,205,196,190,180,172,154,137,124,108]
[1,"DOJ100",3720,880,580,420,387,343,318,303,289,284,264,255,225,200,184,160]
[2,"DOJ125",5780,1470,1180,862,784,686,637,617,588,568,540,515,460,410,370,323]
[3,"DOJ150",11560,2890,2060,1470,1370,1176,1120,1070,1030,980,930,900,800,715,647,558]
[4,"DOJ175",15680,4010,3330,2440,2130,1870,730,1630,560,1520,1430,1370,1190,1080,950,860]
[5,"DOJ200",23900,5880,5450,3990,3500,3050,2830,2670,2560,2480,2350,2240,1960,1781,1558,1410]
[6,"DOJ225",29700,7200,5640,4150,3630,3170,2940,2770,2660,2570,2430,2320,2020,1870,1640]
[7,"DOJ250",42000,11000,8820,6470,5600,4960,4600,4340,4150,4000,3800,3600,3180,2920,2550]
[8,"DOJ300",63000,14500,11500,8400,7350,6400,5900,5600,5400,5200,4900,4700,4120,3800,3330]
[9,"DOJ350",92000,23000,18100,13300,11600,10200,9400,8900,8500,8200,7800,7500,6520,6020,5260]
[10,"DOJ400",142000,34000,26900,19800,17200,15000,14000,13200,12700,12200,11500,11000,9690,8900,7830]
[11,"DOJ450",187000,49000,38300,28100,24600,21500,19900,18800,18000,17400,16400,15700,13800,12700,11100]
[12,"DOJ500",260000,67000,52700,38700,33800,29600,27400,25800,24800,24000,22600,21700,19300,17500,15300]
[13,"DOJ550",343000,89000,70400,51600,45200,39500,36500,34600,33100,32000,30000,29000,25700,23400,20400]
[14,"DOJ625",618000,116000,99000,72700,63600,55600,51400,48700,46600,45000,42600,40700,36300,33000,28800]
{"$rows_empty":10}
["TCAE-S",{"$nulls":3},"Static calculated","Dynamic calculated"]
[1,{"$nulls":3},{"$f":"1479.3*EXP(0.4024*A62)","v":{"v":2212.1590911149824,"d":"2212"}},{"$f":"443.61*EXP(0.4001*A62)","v":{"v":661.8545362651081,"d":"662"}}]
[2,{"$nulls":3},{"$f":"1479.3*EXP(0.4024*A63)","v":{"v":3308.0834478487564,"d":"3308"}},{"$f":"443.61*EXP(0.4001*A63)","v":{"v":987.4696854775619,"d":"987"}}]
[3,{"$nulls":3},{"$f":"1479.3*EXP(0.4024*A64)","v":{"v":4946.939007182872,"d":"4947"}},{"v":1473.2789854998846,"d":"1473"}]
[4,{"$nulls":3},{"$f":"1479.3*EXP(0.4024*A65)","v":{"v":7397.698977848252,"d":"7398"}},{"v":2198.093775472048,"d":"2198"}]
[5,{"$nulls":3},{"$f":"1479.3*EXP(0.4024*A66)","v":{"v":11062.588418291776,"d":"11063"}},{"v":3279.498515435344,"d":"3279"}]
[6,"BC225F",16170,4753,{"$f":"1479.3*EXP(0.4024*A67)","v":{"v":16543.098452502847,"d":"16543"}},{"v":4892.926149355445,"d":"4893"}]
[7,"BC240F",22187,6527,{"v":24738.704547363195,"d":"24739"},{"v":7300.118048648746,"d":"7300"}]
[8,"BC287F",38328,11270,{"v":36994.49075025827,"d":"36994"},{"v":10891.58550476536,"d":"10892"},{"$nulls":7},"Correlation Summary",null,null,"R2 coeff"]
[9,"BC350F",60868,17905,{"v":55321.908358245775,"d":"55322"},{"v":16249.961167350264,"d":"16250"},{"$nulls":7},"torque at rpm","Dynamic Rev","Static","Linear equation Dynamic Rev",{"$nulls":3},"inverse equation for dynamic reverse",{"$nulls":3},"inverse equation for dynamic Rev"]
[10,"BC410F",90856,26725,{"v":82728.90050194238,"d":"82729"},{"v":24244.517735719717,"d":"24245"},{"$nulls":7},10,0.9976,0.9809,"1.2135x + 466.27",{"$nulls":3},"(y-466.27)/1.2135",{"$nulls":3},"(y-32.667)/1.0617"]
[11,"BC450F",129360,38053,{"v":123713.57354378334,"d":"123714"},{"v":36172.18737843142,"d":"36172"},{"$nulls":7},50,0.9976,null,"1.653x + 478.84",{"$nulls":3},"(y-478.84)/1.653",{"$nulls":3},"(y-37.583)/1.6591"]
[12,"BC500F",177449,52195,{"v":185002.43791604278,"d":"185002"},{"v":53967.95902492348,"d":"53968"},{"$nulls":7},100,0.9976,0.981,"1.8899x + 477.35",{"$nulls":3},"(y-477.35)/1.8899",{"$nulls":3},"(y-60.951)/2.2429"]
[13,"BC550F",236190,69462,{"v":276654.380392354,"d":"276654"},{"v":80518.7856306555,"d":"80519"},{"$nulls":7},200,0.9976,null,"2.1597x + 538.33",{"$nulls":3},"(y-538.33)/2.1597",{"$nulls":3},"(y-49.256)/2.5724"]
[14,"BC600F",441980,125440,{"v":413711.55457427737,"d":"413712"},{"v":120131.92561981732,"d":"120132"},{"$nulls":7},300,0.9976,null,"2.3299x + 713.64",{"$nulls":3},"(y-643.72)/2.3321"]
[{"$nulls":13},400,0.9976,null,"2.4675x + 533.71",{"$nulls":3},"(y-463.5)/2.4698"]
[{"$nulls":13},500,0.9975,0.9805,"2.5698x + 735.4",{"$nulls":3},"(y-735.4)/2.5698",{"$nulls":3},"(y-24.918)/3.2564"]
[{"$nulls":13},600,0.9977,null,"2.6676x + 520.47",{"$nulls":3},"(y-450.2)/2.6702"]
[{"$nulls":13},800,0.9973,null,"2.8271x + 527.28",{"$nulls":3},"(y-527.28)/2.8271"]
[{"$nulls":13},1000,0.9977,0.9807,"2.9485x +520.95",{"$nulls":3},"(y-520.95)/2.9485",{"$nulls":3},"(y-43.836)/4.1051"]
[{"$nulls":13},1500,0.9973,null,"3.3127x + 653.13",{"$nulls":3},"(y-653.13)/3.3127"]
[{"$nulls":13},2000,0.9975,0.98,"3.6421x + 577.43",{"$nulls":3},"(y-577.43)/3.6421"]
[{"$nulls":13},3000,0.9975,0.9814,"4.1744x + 526.93",{"$nulls":3},"(y-526.93)/4.1744"]
[{"$nulls":13},4000,0.9913,0.9814,"4.1933x + 200.65",{"$nulls":3},"(y-200.65)/4.1933"]
[null,"BCF Series comparison of dynamic torque to life torques",{"$nulls":11},"AVG",{"$f":"AVERAGE(O71:O83)","v":{"v":0.9975461538461539,"d":"0.9975"}},{"$f":"AVERAGE(P71:P83)","v":{"v":0.98075,"d":"0.9808"}}]
[]
[{"$nulls":4},"rpm"]
[null,"Model","Static Nm","dyn rev",10,50,100,200,300,400,500,600,800,1000,1500,2000,3000]
["Correlation with DOJ data","BC225F",16170,4753,{"$f":"+(D89-466.27)/1.2135","v":{"v":3532.533992583436,"d":"3533"}},{"$f":"+(D89-478.84)/1.653","v":{"v":2585.698729582577,"d":"2586"}},{"$f":"+(D89-477.35)/1.8899","v":{"v":2262.3683792793267,"d":"2262"}},{"$f":"+(D89-538.33)/2.1597","v":{"v":1951.5071537713573,"d":"1952"}},{"$f":"+(D89-713.64)/2.3299","v":{"v":1733.70530924074,"d":"1734"}},{"$f":"+(D89-533.71)/2.4675","v":{"v":1709.9452887537996,"d":"1710"}},{"$f":"+(D89-735.4)/2.5698","v":{"v":1563.3901470931592,"d":"1563"}},{"$f":"+(D89-520.47)/2.6676","v":{"v":1586.6434248013193,"d":"1587"}},{"$f":"+(D89-527.28)/2.8271","v":{"v":1494.7189699692265,"d":"1495"}},{"$f":"+(D89-520.95)/2.9585","v":{"v":1430.4715227311137,"d":"1430"}},{"$f":"+(D89-653.13)/3.3127","v":{"v":1237.6218794336946,"d":"1238"}},{"$f":"+(D89-577.43)/3.6421","v":{"v":1146.4731885450701,"d":"1146"}},{"$f":"+(D89-526.93)/4.1744","v":{"v":1012.3778267535453,"d":"1012"}}]
[null,"BC240F",22187,6527,{"$f":"+(D90-466.27)/1.2135","v":{"v":4994.421096003296,"d":"4994"}},{"$f":"+(D90-478.84)/1.653","v":{"v":3658.898971566848,"d":"3659"}},{"$f":"+(D90-477.35)/1.8899","v":{"v":3201.042383194878,"d":"3201"}},{"$f":"+(D90-538.33)/2.1597","v":{"v":2772.9175348428025,"d":"2773"}},{"$f":"+(D90-713.64)/2.3299","v":{"v":2495.1113781707368,"d":"2495"}},{"$f":"+(D90-533.71)/2.4675","v":{"v":2428.8915906788247,"d":"2429"}},{"$f":"+(D90-665.53)/2.5723","v":{"v":2278.6883333981264,"d":"2279"}},{"$f":"+(D90-520.47)/2.6676","v":{"v":2251.660668765932,"d":"2252"}},{"$f":"+(D90-527.28)/2.8271","v":{"v":2122.2171129425915,"d":"2122"}},{"$f":"+(D90-520.95)/2.9585","v":{"v":2030.0997126922427,"d":"2030"}},{"$f":"+(D90-653.13)/3.3127","v":{"v":1773.1367162737345,"d":"1773"}},{"$f":"+(D90-577.43)/3.6421","v":{"v":1633.5548172757474,"d":"1634"}},{"$f":"+(D90-526.93)/4.1744","v":{"v":1437.3490801073206,"d":"1437"}}]
[null,"BC287F",38328,11270,{"v":8902.95014421096,"d":"8903"},{"v":6528.227465214761,"d":"6528"},{"v":5710.698978781947,"d":"5711"},{"v":4969.055887391767,"d":"4969"},{"v":4530.8210652817725,"d":"4531"},{"v":4351.08004052685,"d":"4351"},{"v":4122.563464603662,"d":"4123"},{"v":4029.6633678212625,"d":"4030"},{"v":3799.908032966644,"d":"3800"},{"v":3633.276998478959,"d":"3633"},{"v":3204.8993268330973,"d":"3205"},{"v":2935.825485296944,"d":"2936"},{"$f":"+(D91-526.93)/4.1744","v":{"v":2573.5602721349173,"d":"2574"}}]
[null,"BC350F",60868,17905,{"v":14370.605686032139,"d":"14371"},{"v":10542.141560798547,"d":"10542"},{"v":9221.466744272186,"d":"9221"},{"v":8041.241839144325,"d":"8041"},{"v":7378.582771792781,"d":"7379"},{"v":7040.036474164134,"d":"7040"},{"v":6701.967111145668,"d":"6702"},{"v":6516.917828759933,"d":"6517"},{"v":6146.835980333204,"d":"6147"},{"v":5875.96755112388,"d":"5876"},{"v":5207.797265070788,"d":"5208"},{"v":4757.57667279866,"d":"4758"},{"$f":"+(D92-526.93)/4.1744","v":{"v":4163.010252970486,"d":"4163"}}]
[null,"BC410F",90856,26725,{"v":21638.838071693448,"d":"21639"},{"v":15877.894736842105,"d":"15878"},{"v":13888.380337584,"d":"13888"},{"v":12125.142380886233,"d":"12125"},{"v":11164.152967938538,"d":"11164"},{"v":10614.504559270517,"d":"10615"},{"v":10130.805116044008,"d":"10131"},{"v":9823.260608786923,"d":"9823"},{"v":9266.640727247002,"d":"9267"},{"v":8857.208044617204,"d":"8857"},{"v":7870.278020949679,"d":"7870"},{"v":7179.256472913978,"d":"7179"},{"$f":"+(D93-526.93)/4.1744","v":{"v":6275.88875047911,"d":"6276"}}]
[null,"BC450F",129360,38053,{"v":30973.819530284305,"d":"30974"},{"v":22730.88929219601,"d":"22731"},{"v":19882.348272395368,"d":"19882"},{"v":17370.31532157244,"d":"17370"},{"v":16026.164213056356,"d":"16026"},{"v":15205.386018237084,"d":"15205"},{"v":14534.646036620925,"d":"14535"},{"v":14069.774328984853,"d":"14070"},{"v":13273.573626684589,"d":"13274"},{"v":12686.175426736523,"d":"12686"},{"v":11289.845141425425,"d":"11290"},{"v":10289.549984898822,"d":"10290"}]
[null,"BC500F",177449,52195,{"v":42627.7132262052,"d":"42628"},{"v":31286.24319419238,"d":"31286"},{"v":27365.283877453836,"d":"27365"},{"v":23918.447006528684,"d":"23918"},{"v":22095.952615992104,"d":"22096"},{"v":20936.693009118542,"d":"20937"},{"v":20032.449558760643,"d":"20032"},{"v":19371.16884090568,"d":"19371"},{"v":18275.872802518483,"d":"18276"},{"v":17466.300490113234,"d":"17466"},{"v":15558.870407824434,"d":"15559"},{"v":14172.474671206171,"d":"14172"}]
[null,"BC550F",236190,69462,{"v":56856.80263700041,"d":"56857"},{"v":41732.09921355112,"d":"41732"},{"v":36501.74612413355,"d":"36502"},{"v":31913.538917442238,"d":"31914"},{"v":29507.00030044208,"d":"29507"},{"v":27934.464032421478,"d":"27934"},{"v":26745.119154064458,"d":"26745"},{"v":25844.028340080968,"d":"25844"},{"v":24383.544975416502,"d":"24384"},{"v":23302.704073009972,"d":"23303"},{"v":20771.234944305248,"d":"20771"},{"v":18913.42082864282,"d":"18913"}]
[null,"BC600F",441980,125440,{"v":102986.18046971569,"d":"102986"},{"v":75596.58802177859,"d":"75597"},{"v":66121.30271442933,"d":"66121"},{"v":57832.879566606476,"d":"57833"},{"v":53532.92415983519,"d":"53533"},{"v":50620.58358662614,"d":"50621"},{"v":48506.96652800996,"d":"48507"},{"v":46828.433798170634,"d":"46828"},{"v":44184.04725690637,"d":"44184"},{"v":42223.77894203144,"d":"42224"},{"v":37669.23355570984,"d":"37669"},{"v":34283.125120123004,"d":"34283"}]
[]
[{"$nulls":4},"rpm"]
[null,"Model","Static Nm","dyn rev",10,50,100,200,300,400,500,600,800,1000,1500,2000,3000,4000]
["Correlation with BJD data","BC225F",16170,4753,{"$f":"+(D101-32.667)/1.0617","v":{"v":4446.013939907694,"d":"4446"}},null,{"$f":"+(D101-37.583)/1.6591","v":{"v":2842.153577240673,"d":"2842"}},{"$nulls":3},{"$f":"+(D101-60.951)/2.2429","v":{"v":2091.956395737661,"d":"2092"}},null,null,{"$f":"+(D101-49.256)/2.5724","v":{"v":1828.542994868605,"d":"1829"}},null,{"$f":"+(D101-24.918)/3.2564","v":{"v":1451.9352659378455,"d":"1452"}},null,{"$f":"+(D101-43.836)/4.1051","v":{"v":1147.1496431268422,"d":"1147"}}]
[null,"BC240F",22187,6527,{"$f":"+(D102-32.667)/1.0617","v":{"v":6116.919092022227,"d":"6117"}},null,{"$f":"+(D102-37.583)/1.6591","v":{"v":3911.407992284974,"d":"3911"}},{"$nulls":3},{"$f":"+(D102-60.951)/2.2429","v":{"v":2882.896696241473,"d":"2883"}},null,null,{"$f":"+(D102-49.256)/2.5724","v":{"v":2518.1713574871715,"d":"2518"}},null,{"v":1996.7086353027883,"d":"1997"},null,{"v":1579.295023263745,"d":"1579"}]
[null,"BC287F",38328,11270,{"v":10584.282754073654,"d":"10584"},null,{"v":6770.186848291241,"d":"6770"},{"$nulls":3},{"v":4997.569664273931,"d":"4998"},null,null,{"v":4361.974809516405,"d":"4362"},null,{"v":3453.225033779634,"d":"3453"},null,{"v":2734.6870965384524,"d":"2735"}]
[null,"BC350F",60868,17905,{"v":16833.694075539228,"d":"16834"},null,{"v":10769.343017298535,"d":"10769"},{"$nulls":3},{"v":7955.793392482945,"d":"7956"},null,null,{"v":6941.278183797232,"d":"6941"},null,{"v":5490.75113622405,"d":"5491"},null,{"v":4350.9692821124945,"d":"4351"}]
[null,"BC410F",90856,26725,{"v":25141.12555335782,"d":"25141"},null,{"v":16085.478271351938,"d":"16085"},{"$nulls":3},{"v":11888.202327344063,"d":"11888"},null,null,{"v":10369.982895350644,"d":"10370"},null,{"v":8199.263603979854,"d":"8199"},null,{"v":6499.516211541741,"d":"6500"}]
[null,"BC450F",129360,38053,{"v":35810.80625412075,"d":"35811"},null,{"v":22913.276475197395,"d":"22913"},{"$nulls":3},{"v":16938.80645592759,"d":"16939"},null,null,{"v":14773.652620121287,"d":"14774"},null,{"v":11677.951725832207,"d":"11678"},null,{"v":9259.01049913522,"d":"9259"}]
[null,"BC500F",177449,52195,{"v":49130.95318828294,"d":"49131"},null,{"v":31437.174974383703,"d":"31437"},{"$nulls":3},{"v":23244.036292300145,"d":"23244"},null,null,{"v":20271.242419530397,"d":"20271"},null,{"v":16020.78430168284,"d":"16021"},null,{"v":12703.993568975176,"d":"12704"}]
[null,"BC550F",236190,69462,{"v":65394.49279457473,"d":"65394"},null,{"v":41844.624796576456,"d":"41845"},{"$nulls":3},{"v":30942.551607294125,"d":"30943"},null,null,{"v":26983.651065153168,"d":"26984"},null,{"v":21323.265569340372,"d":"21323"},null,{"v":16910.224842269374,"d":"16910"}]
[null,"BC600F",441980,125440,{"v":118119.36799472543,"d":"118119"},null,{"v":75584.60430353806,"d":"75585"},{"$nulls":3},{"v":55900.41865442061,"d":"55900"},null,null,{"v":48744.65246462448,"d":"48745"},null,{"v":38513.414199729756,"d":"38513"},null,{"v":30546.433460817032,"d":"30546"}]

{"sheet":"Daves scratchpad 2","index":7,"n_rows":123,"n_cols":32,"rows_kept":123,"hidden":true,"merged":[[1,1,1,11],[3,1,3,6],[4,5,4,7],[4,18,4,31],[35,16,41,16],[35,17,35,18],[35,19,35,20],[35,22,35,23],[35,24,35,25],[36,17,36,18],[36,19,36,20],[36,22,36,23],[36,24,36,25],[37,17,37,18],[37,19,37,20],[37,22,37,23],[37,24,37,25],[38,17,38,18],[38,19,38,20],[38,22,38,23],[38,24,38,25],[39,17,39,18],[39,19,39,20],[39,22,39,23],[39,24,39,25],[40,17,40,18],[40,19,40,20],[40,22,40,23],[40,24,40,25],[41,17,41,18],[41,19,41,20],[41,22,41,23],[41,24,41,25],[42,17,42,18],[44,1,44,6],[45,4,45,17],[55,17,63,17],[83,20,83,21],[83,24,83,25],[84,16,84,17],[84,20,84,21],[84,24,84,25],[85,16,85,17],[85,20,85,21],[85,24,85,25],[86,16,86,17],[86,20,86,21],[86,24,86,25],[87,16,87,17],[87,20,87,21],[87,24,87,25],[88,16,88,17],[88,20,88,21],[89,16,89,17],[89,20,89,21],[90,16,90,17],[90,20,90,21],[90,24,90,25],[91,16,91,17],[91,20,91,21],[92,16,92,17],[92,20,92,21],[93,16,93,17],[93,20,93,21],[93,24,93,25],[94,16,94,17],[94,20,94,21],[95,16,95,17],[95,20,95,21],[96,16,96,17],[96,20,96,21],[97,16,97,17],[97,20,97,21],[98,1,98,6],[102,0,110,0],[114,0,122,0]]}
[null,"OBJECTIVE: "]
[2,"Determine the correlation between Service life data and strength data for BJ and DOJ to apply to BCF models"]
[]
[null,"BJ-D Series comparison of dynamic torque to life torques"]
[{"$nulls":5},"formulas",{"$nulls":5},"Rule 1","Rule 2",{"$nulls":5},"rpm"]
[null,"Model","static","dyn rev","dyn fwd","static ","dyn fwd","dyn rev",null,"rev/static","fwd/static","Dyn fwd","Dyn rev",null,"Model","static","dyn fwd","dyn rev",10,50,100,200,300,400,500,600,800,1000,1500,2000,3000,4000]
[1,"BJ75",1520,392,558,{"$f":"+(998.24*A7^2)-(2886.5*A7)+4599","v":{"v":2710.74,"d":"2,711"}},{"$f":"+(475.67*A7^2)-(1369.7*A7)+1952.2","v":{"v":1058.17,"d":"1,058"}},{"$f":"+(249.43*(A7^2))-(713.79*A7)+1147.6","v":{"v":683.24,"d":"683"}},null,{"$f":"+H7/F7","v":{"v":0.25204925592273697,"d":"0.252"}},{"$f":"+H7/G7","v":{"v":0.6456807507300338,"d":"0.646"}},{"$f":"+M7/0.54","v":{"v":703.7037037037037,"d":"704"}},{"$f":"0.25*C7","v":380},null,"BJ75",1520,558,392,285,209,183,160,151,140,134,129,122,117,102,93,81,74]
[2,"BJ95",2500,637,{"v":1127,"d":"1,127"},{"$f":"+(998.24*A8^2)-(2886.5*A8)+4599","v":{"v":2818.96,"d":"2,819"}},{"$f":"+(475.67*A8^2)-(1369.7*A8)+1952.2","v":{"v":1115.48,"d":"1,115"}},{"v":717.74,"d":"718"},null,{"$f":"+H8/F8","v":{"v":0.2546116298209269,"d":"0.255"}},{"$f":"+H8/G8","v":{"v":0.6434360096102126,"d":"0.643"}},{"v":1157.4074074074074,"d":"1,157"},625,null,"BJ95",2500,{"v":1127,"d":"1,127"},637,570,415,365,320,300,280,270,260,245,234,205,186,162,148]
[3,"BJ125",5780,1470,{"v":2744,"d":"2,744"},{"v":4923.66,"d":"4,924"},{"v":2124.129999999999,"d":"2,124"},{"v":1251.1,"d":"1251"},null,{"v":0.2540995925795039,"d":"0.254"},{"v":0.5889940822830996,"d":"0.589"},{"v":2675.9259259259256,"d":"2,676"},{"v":1445,"d":"1,445"},null,"BJ125",5780,{"v":2744,"d":"2,744"},1470,{"v":1350,"d":"1,350"},980,860,730,710,660,630,610,580,550,485,440,385,350]
[4,"BJ150",11564,2890,{"v":4704,"d":"4,704"},{"v":9024.84,"d":"9,025"},{"v":4084.12,"d":"4,084"},{"v":2283.32,"d":"2283"},null,{"v":0.2530039313716365,"d":"0.253"},{"v":0.5590727010959522,"d":"0.559"},{"v":5353.7037037037035,"d":"5,354"},{"v":2891,"d":"2,891"},null,"BJ150",11564,{"v":4704,"d":"4,704"},2890,{"v":2300,"d":"2,300"},1700,1450,1300,1200,1150,1100,1050,980,940,820,750,650,600]
[5,"BJ175",15680,4018,{"v":6713,"d":"6,713"},{"v":15122.5,"d":"15,123"},{"v":6995.45,"d":"6,995"},{"v":3814.4,"d":"3814"},null,{"v":0.2522334270127294,"d":"0.252"},{"v":0.5452687103760302,"d":"0.545"},{"v":7259.259259259259,"d":"7,259"},{"v":3920,"d":"3,920"},null,"BJ175",15680,{"v":6713,"d":"6,713"},4018,{"v":3650,"d":"3,650"},2650,2350,2050,1950,1800,1700,1650,1550,1500,1300,1200,1050,940]
[6,"BJ200",23912,5880,{"v":11172,"d":"11,172"},{"v":23216.64,"d":"23,217"},{"v":10858.119999999999,"d":"10,858"},{"v":5844.34,"d":"5844"},null,{"v":0.25173065525416255,"d":"0.252"},{"v":0.5382460315413718,"d":"0.538"},{"v":11070.37037037037,"d":"11,070"},{"v":5978,"d":"5,978"},null,"BJ200",23912,{"v":11172,"d":"11,172"},5880,{"v":5500,"d":"5,500"},4000,3500,3050,2900,2700,2550,2500,2350,2250,1950,1800,1550,1400]
[7,"BJ225",29694,7546,{"v":14700,"d":"14,700"},{"v":33307.26,"d":"33,307"},{"v":15672.130000000003,"d":"15,672"},{"v":8373.14,"d":"8373"},null,{"v":0.2513908379134158,"d":"0.251"},{"v":0.5342694324255859,"d":"0.534"},{"v":13747.22222222222,"d":"13,747"},{"v":7423.5,"d":"7,424"},null,"BJ225",29694,{"v":14700,"d":"14,700"},7546,{"v":7800,"d":"7,800"},5700,5000,4350,4150,3800,3650,3550,3350,3200,2800,2550,2200,2000]
[8,"BJ250",42238,10682,{"v":20678,"d":"20,678"},{"v":45394.36,"d":"45,394"},{"v":21437.48,"d":"21,437"},{"v":11400.800000000001,"d":"11401"},null,{"v":0.25115014288118614,"d":"0.251"},{"v":0.5318162395953256,"d":"0.532"},{"v":19554.629629629628,"d":"19,555"},{"v":10559.5,"d":"10,560"},null,"BJ250",42238,{"v":20678,"d":"20,678"},10682,{"v":10600,"d":"10,600"},7800,6800,6000,5700,5200,5000,4850,4600,4400,3800,3450,3050,2750]
[9,"BJ300",63112,15780,{"v":29106,"d":"29,106"},{"v":59477.94,"d":"59,478"},{"v":28154.170000000002,"d":"28,154"},{"v":14927.320000000002,"d":"14927"},null,{"v":0.25097237732174316,"d":"0.251"},{"v":0.5301992564511758,"d":"0.530"},{"v":29218.51851851852,"d":"29,219"},{"v":15778,"d":"15,778"},null,"BJ300",63112,{"v":29106,"d":"29,106"},15780,{"v":14100,"d":"14,100"},10300,9000,7900,7500,6900,6700,6300,6100,5800,5100,4600,4000,3650]
[{"$nulls":9},{"$f":"AVERAGE(J7:J15)","v":{"v":0.2523602055642268,"d":"0.252"}},{"$f":"AVERAGE(K7:K15)","v":{"v":0.5685536904565319,"d":"0.569"}},"fair","good"]
[{"$nulls":3},"Rules:"]
[null,null,1,"Dynamic reversing = 0.54 x Dynamic fwd (non reversing)"]
[null,null,2,"Dynamic reversing = 0.25 x Static"]
{"$rows_empty":15}
[{"$nulls":12},"Correlation Summary",null,null,"R2 coeff"]
[{"$nulls":12},"torque at rpm","Dynamic Rev","Dynamic Fwd","Static","Most accurate parameter","Linear equation Dynamic Fwd",null,"inverse equation for dynamic Fwd",null,null,"Linear equation Dynamic Rev",null,"inverse equation for dynamic Rev"]
[{"$nulls":12},10,0.9918,0.9972,0.99,null,"2.0185x - 184.87",null,"(y-184.87)/2.0185",null,null,"1.0617x + 32.667",null,"(y-32.667)/1.0617"]
[{"$nulls":12},100,0.9911,0.9967,0.9892,null,"3.1548x - 176.69",null,"(y-176.69)/3.1548",null,null,"1.6591x + 37.583",null,"(y-37.583)/1.6591"]
[{"$nulls":12},500,0.993,0.9978,0.9913,null,"4.2631x - 127.94",null,"(y-127.94)/4.2631",null,null,"2.2429x + 60.951",null,"(y-60.951)/2.2429"]
[{"$nulls":12},1000,0.9912,0.9969,0.9894,null,"4.8915x - 154.63",null,"(y-154.63)/4.8915",null,null,"2.5724x + 49.256",null,"(y-49.256)/2.5724"]
[{"$nulls":12},2000,0.9918,0.9971,0.9901,null,"6.1911x - 199.04",null,"(y-199.04)/6.1911",null,null,"3.2564x + 24.918",null,"(y-24.918)/3.2564"]
[{"$nulls":12},4000,0.9922,0.9973,0.9904,null,"7.8041x - 162.31",null,"(y-162.31)/7.8041",null,null,"4.1051x + 43.836",null,"(y-43.836)/4.1051"]
[{"$nulls":12},"AVG",{"$f":"AVERAGE(N37:N42)","v":{"v":0.99185,"d":"0.9919"}},{"$f":"AVERAGE(O37:O42)","v":{"v":0.9971666666666666,"d":"0.9972"}},{"$f":"AVERAGE(P37:P42)","v":{"v":0.9900666666666665,"d":"0.9901"}}]
[]
[null,"DOJ Series comparison of dynamic torque to life torques"]
[{"$nulls":4},"rpm"]
[null,"Model","static","dyn rev",10,50,100,200,300,400,500,600,800,1000,1500,2000,3000,4000]
[null,"DOJ68",1090,275,180,130,118,104,97,93,89,87,81,78,69,61,56,49]
[null,"DOJ75",1520,392,250,176,167,148,137,132,125,122,110,110,98,88,79,69]
[null,"DOJ87",2500,640,400,284,260,230,215,205,196,190,180,172,154,137,124,108]
[null,"DOJ100",3720,880,580,420,387,343,318,303,289,284,264,255,225,200,184,160]
[null,"DOJ125",5780,1470,1180,862,784,686,637,617,588,568,540,515,460,410,370,323]
[null,"DOJ150",11560,2890,2060,1470,1370,1176,1120,1070,1030,980,930,900,800,715,647,558]
[null,"DOJ175",15680,4010,3330,2440,2130,1870,730,1630,560,1520,1430,1370,1190,1080,950,860]
[null,"DOJ200",23900,5880,5450,3990,3500,3050,2830,2670,2560,2480,2350,2240,1960,1781,1558,1410]
[null,"DOJ225",29700,7200,5640,4150,3630,3170,2940,2770,2660,2570,2430,2320,2020,1870,1640]
[null,"DOJ250",42000,11000,8820,6470,5600,4960,4600,4340,4150,4000,3800,3600,3180,2920,2550]
[null,"DOJ300",63000,14500,11500,8400,7350,6400,5900,5600,5400,5200,4900,4700,4120,3800,3330]
[null,"DOJ350",92000,23000,18100,13300,11600,10200,9400,8900,8500,8200,7800,7500,6520,6020,5260]
[null,"DOJ400",142000,34000,26900,19800,17200,15000,14000,13200,12700,12200,11500,11000,9690,8900,7830]
[null,"DOJ450",187000,49000,38300,28100,24600,21500,19900,18800,18000,17400,16400,15700,13800,12700,11100]
[null,"DOJ500",260000,67000,52700,38700,33800,29600,27400,25800,24800,24000,22600,21700,19300,17500,15300]
[null,"DOJ550",343000,89000,70400,51600,45200,39500,36500,34600,33100,32000,30000,29000,25700,23400,20400]
[null,"DOJ625",618000,116000,99000,72700,63600,55600,51400,48700,46600,45000,42600,40700,36300,33000,28800]
{"$rows_empty":18}
[{"$nulls":13},"Correlation Summary",null,null,"R2 coeff"]
[{"$nulls":13},"torque at rpm","Dynamic Rev","Static","Linear equation Dynamic Rev",{"$nulls":3},"inverse equation for dynamic reverse",{"$nulls":3},"inverse equation for dynamic Rev"]
[{"$nulls":13},10,0.9976,0.9809,"1.2135x + 466.27",{"$nulls":3},"(y-466.27)/1.2135",{"$nulls":3},"(y-32.667)/1.0617"]
[{"$nulls":13},50,0.9976,null,"1.653x + 478.84",{"$nulls":3},"(y-478.84)/1.653",{"$nulls":3},"(y-37.583)/1.6591"]
[{"$nulls":13},100,0.9976,0.981,"1.8899x + 477.35",{"$nulls":3},"(y-477.35)/1.8899",{"$nulls":3},"(y-60.951)/2.2429"]
[{"$nulls":13},200,0.9976,null,"2.1597x + 538.33",{"$nulls":3},"(y-538.33)/2.1597",{"$nulls":3},"(y-49.256)/2.5724"]
[{"$nulls":13},300,0.9976,null,"2.3299x + 713.64",{"$nulls":3},"(y-643.72)/2.3321"]
[{"$nulls":13},400,0.9976,null,"2.4675x + 533.71",{"$nulls":3},"(y-463.5)/2.4698"]
[{"$nulls":13},500,0.9975,0.9805,"2.5698x + 735.4",{"$nulls":3},"(y-735.4)/2.5698",{"$nulls":3},"(y-24.918)/3.2564"]
[{"$nulls":13},600,0.9977,null,"2.6676x + 520.47",{"$nulls":3},"(y-450.2)/2.6702"]
[{"$nulls":13},800,0.9973,null,"2.8271x + 527.28",{"$nulls":3},"(y-527.28)/2.8271"]
[{"$nulls":13},1000,0.9977,0.9807,"2.9485x +520.95",{"$nulls":3},"(y-520.95)/2.9485",{"$nulls":3},"(y-43.836)/4.1051"]
[{"$nulls":13},1500,0.9973,null,"3.3127x + 653.13",{"$nulls":3},"(y-653.13)/3.3127"]
[{"$nulls":13},2000,0.9975,0.98,"3.6421x + 577.43",{"$nulls":3},"(y-577.43)/3.6421"]
[{"$nulls":13},3000,0.9975,0.9814,"4.1744x + 526.93",{"$nulls":3},"(y-526.93)/4.1744"]
[{"$nulls":13},4000,0.9913,0.9814,"4.1933x + 200.65",{"$nulls":3},"(y-200.65)/4.1933"]
[null,"BCF Series comparison of dynamic torque to life torques",{"$nulls":11},"AVG",{"$f":"AVERAGE(O85:O97)","v":{"v":0.9975461538461539,"d":"0.9975"}},{"$f":"AVERAGE(P85:P97)","v":{"v":0.98075,"d":"0.9808"}}]
[]
[{"$nulls":4},"rpm"]
[null,"Model","Static Nm","dyn rev",10,50,100,200,300,400,500,600,800,1000,1500,2000,3000]
["Correlation with DOJ data","BC225F",16170,4753,{"$f":"+(D103-466.27)/1.2135","v":{"v":3532.533992583436,"d":"3533"}},{"$f":"+(D103-478.84)/1.653","v":{"v":2585.698729582577,"d":"2586"}},{"$f":"+(D103-477.35)/1.8899","v":{"v":2262.3683792793267,"d":"2262"}},{"$f":"+(D103-538.33)/2.1597","v":{"v":1951.5071537713573,"d":"1952"}},{"$f":"+(D103-713.64)/2.3299","v":{"v":1733.70530924074,"d":"1734"}},{"$f":"+(D103-533.71)/2.4675","v":{"v":1709.9452887537996,"d":"1710"}},{"$f":"+(D103-735.4)/2.5698","v":{"v":1563.3901470931592,"d":"1563"}},{"$f":"+(D103-520.47)/2.6676","v":{"v":1586.6434248013193,"d":"1587"}},{"$f":"+(D103-527.28)/2.8271","v":{"v":1494.7189699692265,"d":"1495"}},{"$f":"+(D103-520.95)/2.9585","v":{"v":1430.4715227311137,"d":"1430"}},{"$f":"+(D103-653.13)/3.3127","v":{"v":1237.6218794336946,"d":"1238"}},{"$f":"+(D103-577.43)/3.6421","v":{"v":1146.4731885450701,"d":"1146"}},{"$f":"+(D103-526.93)/4.1744","v":{"v":1012.3778267535453,"d":"1012"}}]
[null,"BC240F",22187,6527,{"$f":"+(D104-466.27)/1.2135","v":{"v":4994.421096003296,"d":"4994"}},{"$f":"+(D104-478.84)/1.653","v":{"v":3658.898971566848,"d":"3659"}},{"$f":"+(D104-477.35)/1.8899","v":{"v":3201.042383194878,"d":"3201"}},{"$f":"+(D104-538.33)/2.1597","v":{"v":2772.9175348428025,"d":"2773"}},{"$f":"+(D104-713.64)/2.3299","v":{"v":2495.1113781707368,"d":"2495"}},{"$f":"+(D104-533.71)/2.4675","v":{"v":2428.8915906788247,"d":"2429"}},{"$f":"+(D104-665.53)/2.5723","v":{"v":2278.6883333981264,"d":"2279"}},{"$f":"+(D104-520.47)/2.6676","v":{"v":2251.660668765932,"d":"2252"}},{"$f":"+(D104-527.28)/2.8271","v":{"v":2122.2171129425915,"d":"2122"}},{"$f":"+(D104-520.95)/2.9585","v":{"v":2030.0997126922427,"d":"2030"}},{"$f":"+(D104-653.13)/3.3127","v":{"v":1773.1367162737345,"d":"1773"}},{"$f":"+(D104-577.43)/3.6421","v":{"v":1633.5548172757474,"d":"1634"}},{"$f":"+(D104-526.93)/4.1744","v":{"v":1437.3490801073206,"d":"1437"}}]
[null,"BC287F",38328,11270,{"v":8902.95014421096,"d":"8903"},{"v":6528.227465214761,"d":"6528"},{"v":5710.698978781947,"d":"5711"},{"v":4969.055887391767,"d":"4969"},{"v":4530.8210652817725,"d":"4531"},{"v":4351.08004052685,"d":"4351"},{"v":4122.563464603662,"d":"4123"},{"v":4029.6633678212625,"d":"4030"},{"v":3799.908032966644,"d":"3800"},{"v":3633.276998478959,"d":"3633"},{"v":3204.8993268330973,"d":"3205"},{"v":2935.825485296944,"d":"2936"},{"$f":"+(D105-526.93)/4.1744","v":{"v":2573.5602721349173,"d":"2574"}}]
[null,"BC350F",60868,17905,{"v":14370.605686032139,"d":"14371"},{"v":10542.141560798547,"d":"10542"},{"v":9221.466744272186,"d":"9221"},{"v":8041.241839144325,"d":"8041"},{"v":7378.582771792781,"d":"7379"},{"v":7040.036474164134,"d":"7040"},{"v":6701.967111145668,"d":"6702"},{"v":6516.917828759933,"d":"6517"},{"v":6146.835980333204,"d":"6147"},{"v":5875.96755112388,"d":"5876"},{"v":5207.797265070788,"d":"5208"},{"v":4757.57667279866,"d":"4758"},{"$f":"+(D106-526.93)/4.1744","v":{"v":4163.010252970486,"d":"4163"}}]
[null,"BC410F",90856,26725,{"v":21638.838071693448,"d":"21639"},{"v":15877.894736842105,"d":"15878"},{"v":13888.380337584,"d":"13888"},{"v":12125.142380886233,"d":"12125"},{"v":11164.152967938538,"d":"11164"},{"v":10614.504559270517,"d":"10615"},{"v":10130.805116044008,"d":"10131"},{"v":9823.260608786923,"d":"9823"},{"v":9266.640727247002,"d":"9267"},{"v":8857.208044617204,"d":"8857"},{"v":7870.278020949679,"d":"7870"},{"v":7179.256472913978,"d":"7179"},{"$f":"+(D107-526.93)/4.1744","v":{"v":6275.88875047911,"d":"6276"}}]
[null,"BC450F",129360,38053,{"v":30973.819530284305,"d":"30974"},{"v":22730.88929219601,"d":"22731"},{"v":19882.348272395368,"d":"19882"},{"v":17370.31532157244,"d":"17370"},{"v":16026.164213056356,"d":"16026"},{"v":15205.386018237084,"d":"15205"},{"v":14534.646036620925,"d":"14535"},{"v":14069.774328984853,"d":"14070"},{"v":13273.573626684589,"d":"13274"},{"v":12686.175426736523,"d":"12686"},{"v":11289.845141425425,"d":"11290"},{"v":10289.549984898822,"d":"10290"}]
[null,"BC500F",177449,52195,{"v":42627.7132262052,"d":"42628"},{"v":31286.24319419238,"d":"31286"},{"v":27365.283877453836,"d":"27365"},{"v":23918.447006528684,"d":"23918"},{"v":22095.952615992104,"d":"22096"},{"v":20936.693009118542,"d":"20937"},{"v":20032.449558760643,"d":"20032"},{"v":19371.16884090568,"d":"19371"},{"v":18275.872802518483,"d":"18276"},{"v":17466.300490113234,"d":"17466"},{"v":15558.870407824434,"d":"15559"},{"v":14172.474671206171,"d":"14172"}]
[null,"BC550F",236190,69462,{"v":56856.80263700041,"d":"56857"},{"v":41732.09921355112,"d":"41732"},{"v":36501.74612413355,"d":"36502"},{"v":31913.538917442238,"d":"31914"},{"v":29507.00030044208,"d":"29507"},{"v":27934.464032421478,"d":"27934"},{"v":26745.119154064458,"d":"26745"},{"v":25844.028340080968,"d":"25844"},{"v":24383.544975416502,"d":"24384"},{"v":23302.704073009972,"d":"23303"},{"v":20771.234944305248,"d":"20771"},{"v":18913.42082864282,"d":"18913"}]
[null,"BC600F",441980,125440,{"v":102986.18046971569,"d":"102986"},{"v":75596.58802177859,"d":"75597"},{"v":66121.30271442933,"d":"66121"},{"v":57832.879566606476,"d":"57833"},{"v":53532.92415983519,"d":"53533"},{"v":50620.58358662614,"d":"50621"},{"v":48506.96652800996,"d":"48507"},{"v":46828.433798170634,"d":"46828"},{"v":44184.04725690637,"d":"44184"},{"v":42223.77894203144,"d":"42224"},{"v":37669.23355570984,"d":"37669"},{"v":34283.125120123004,"d":"34283"}]
[]
[{"$nulls":4},"rpm"]
[null,"Model","Static Nm","dyn rev",10,50,100,200,300,400,500,600,800,1000,1500,2000,3000,4000]
["Correlation with BJD data","BC225F",16170,4753,{"$f":"+(D115-32.667)/1.0617","v":{"v":4446.013939907694,"d":"4446"}},null,{"$f":"+(D115-37.583)/1.6591","v":{"v":2842.153577240673,"d":"2842"}},{"$nulls":3},{"$f":"+(D115-60.951)/2.2429","v":{"v":2091.956395737661,"d":"2092"}},null,null,{"$f":"+(D115-49.256)/2.5724","v":{"v":1828.542994868605,"d":"1829"}},null,{"$f":"+(D115-24.918)/3.2564","v":{"v":1451.9352659378455,"d":"1452"}},null,{"$f":"+(D115-43.836)/4.1051","v":{"v":1147.1496431268422,"d":"1147"}}]
[null,"BC240F",22187,6527,{"$f":"+(D116-32.667)/1.0617","v":{"v":6116.919092022227,"d":"6117"}},null,{"$f":"+(D116-37.583)/1.6591","v":{"v":3911.407992284974,"d":"3911"}},{"$nulls":3},{"$f":"+(D116-60.951)/2.2429","v":{"v":2882.896696241473,"d":"2883"}},null,null,{"v":2518.1713574871715,"d":"2518"},null,{"v":1996.7086353027883,"d":"1997"},null,{"v":1579.295023263745,"d":"1579"}]
[null,"BC287F",38328,11270,{"v":10584.282754073654,"d":"10584"},null,{"v":6770.186848291241,"d":"6770"},{"$nulls":3},{"v":4997.569664273931,"d":"4998"},null,null,{"v":4361.974809516405,"d":"4362"},null,{"v":3453.225033779634,"d":"3453"},null,{"v":2734.6870965384524,"d":"2735"}]
[null,"BC350F",60868,17905,{"v":16833.694075539228,"d":"16834"},null,{"v":10769.343017298535,"d":"10769"},{"$nulls":3},{"v":7955.793392482945,"d":"7956"},null,null,{"v":6941.278183797232,"d":"6941"},null,{"v":5490.75113622405,"d":"5491"},null,{"v":4350.9692821124945,"d":"4351"}]
[null,"BC410F",90856,26725,{"v":25141.12555335782,"d":"25141"},null,{"v":16085.478271351938,"d":"16085"},{"$nulls":3},{"v":11888.202327344063,"d":"11888"},null,null,{"v":10369.982895350644,"d":"10370"},null,{"v":8199.263603979854,"d":"8199"},null,{"v":6499.516211541741,"d":"6500"}]
[null,"BC450F",129360,38053,{"v":35810.80625412075,"d":"35811"},null,{"v":22913.276475197395,"d":"22913"},{"$nulls":3},{"v":16938.80645592759,"d":"16939"},null,null,{"v":14773.652620121287,"d":"14774"},null,{"v":11677.951725832207,"d":"11678"},null,{"v":9259.01049913522,"d":"9259"}]
[null,"BC500F",177449,52195,{"v":49130.95318828294,"d":"49131"},null,{"v":31437.174974383703,"d":"31437"},{"$nulls":3},{"v":23244.036292300145,"d":"23244"},null,null,{"v":20271.242419530397,"d":"20271"},null,{"v":16020.78430168284,"d":"16021"},null,{"v":12703.993568975176,"d":"12704"}]
[null,"BC550F",236190,69462,{"v":65394.49279457473,"d":"65394"},null,{"v":41844.624796576456,"d":"41845"},{"$nulls":3},{"v":30942.551607294125,"d":"30943"},null,null,{"v":26983.651065153168,"d":"26984"},null,{"v":21323.265569340372,"d":"21323"},null,{"v":16910.224842269374,"d":"16910"}]
[null,"BC600F",441980,125440,{"v":118119.36799472543,"d":"118119"},null,{"v":75584.60430353806,"d":"75585"},{"$nulls":3},{"v":55900.41865442061,"d":"55900"},null,null,{"v":48744.65246462448,"d":"48745"},null,{"v":38513.414199729756,"d":"38513"},null,{"v":30546.433460817032,"d":"30546"}]

{"sheet":"Basic life graph","index":12,"n_rows":68,"n_cols":21,"rows_kept":68,"hidden":true,"merged":[[2,5,2,18],[13,5,13,18],[23,18,31,18],[33,5,33,18],[50,5,50,20]]}
[]
[]
[{"$nulls":5},"rpm"]
[null,"Model",null,"static","dyn fwd",10,50,100,200,300,400,500,600,800,1000,1500,2000,3000,4000]
[null,"BJ95","TCAE-R-1",2500,{"v":1127,"d":"1,127"},570,415,365,320,300,280,270,260,245,234,205,186,162,148]
[null,"BJ125","TCAE-R-2",5780,{"v":2744,"d":"2,744"},{"v":1350,"d":"1,350"},980,860,730,710,660,630,610,580,550,485,440,385,350]
[null,"BJ150","TCAE-R-3",11564,{"v":4704,"d":"4,704"},{"v":2300,"d":"2,300"},1700,1450,1300,1200,1150,1100,1050,980,940,820,750,650,600]
[null,"BJ175","TCAE-R-4",15680,{"v":6713,"d":"6,713"},{"v":3650,"d":"3,650"},2650,2350,2050,1950,1800,1700,1650,1550,1500,1300,1200,1050,940]
[null,"BJ200","TCAE-R-5",23912,{"v":11172,"d":"11,172"},{"v":5500,"d":"5,500"},4000,3500,3050,2900,2700,2550,2500,2350,2250,1950,1800,1550,1400]
[null,"BJ225","TCAE-R-6",29694,{"v":14700,"d":"14,700"},{"v":7800,"d":"7,800"},5700,5000,4350,4150,3800,3650,3550,3350,3200,2800,2550,2200,2000]
[null,"BJ250","TCAE-R-7",42238,{"v":20678,"d":"20,678"},{"v":10600,"d":"10,600"},7800,6800,6000,5700,5200,5000,4850,4600,4400,3800,3450,3050,2750]
[null,"BJ300","TCAE-R-8",63112,{"v":29106,"d":"29,106"},{"v":14100,"d":"14,100"},10300,9000,7900,7500,6900,6700,6300,6100,5800,5100,4600,4000,3650]
[]
[{"$nulls":5},"rpm"]
[null,"Model",null,"static","dyn rev",10,50,100,200,300,400,500,600,800,1000,1500,2000,3000,4000]
[null,"DOJ68","TCAE-S-000",1090,275,180,130,118,104,97,93,89,87,81,78,69,61,56,49]
[null,"DOJ75","TCAE-S-00",1520,392,250,176,167,148,137,132,125,122,110,110,98,88,79,69]
[null,"DOJ87","TCAE-S-0",2500,640,400,284,260,230,215,205,196,190,180,172,154,137,124,108]
[null,"DOJ100","TCAE-S-1",3720,880,580,420,387,343,318,303,289,284,264,255,225,200,184,160]
[null,"DOJ125","TCAE-S-2",5780,1470,1180,862,784,686,637,617,588,568,540,515,460,410,370,323]
[null,"DOJ150","TCAE-S-3",11560,2890,2060,1470,1370,1176,1120,1070,1030,980,930,900,800,715,647,558]
[null,"DOJ175","TCAE-S-4",15680,4010,3330,2440,2130,1870,1730,1630,1560,1520,1430,1370,1190,1080,950,860]
[null,"DOJ200","TCAE-S-5",23900,5880,5450,3990,3500,3050,2830,2670,2560,2480,2350,2240,1960,1781,1558,1410]
[null,"DOJ225","TCAE-S-6",29700,7200,5640,4150,3630,3170,2940,2770,2660,2570,2430,2320,2020,1870,1640]
[null,"DOJ250","TCAE-S-7",42000,11000,8820,6470,5600,4960,4600,4340,4150,4000,3800,3600,3180,2920,2550]
[null,"DOJ300","TCAE-S-8",63000,14500,11500,8400,7350,6400,5900,5600,5400,5200,4900,4700,4120,3800,3330]
[null,"DOJ350","TCAE-S-9",92000,23000,18100,13300,11600,10200,9400,8900,8500,8200,7800,7500,6520,6020,5260]
[null,"DOJ400","TCAE-S-10",142000,34000,26900,19800,17200,15000,14000,13200,12700,12200,11500,11000,9690,8900,7830]
[null,"DOJ450","TCAE-S-11",187000,49000,38300,28100,24600,21500,19900,18800,18000,17400,16400,15700,13800,12700,11100]
[null,"DOJ500","TCAE-S-12",260000,67000,52700,38700,33800,29600,27400,25800,24800,24000,22600,21700,19300,17500,15300]
[null,"DOJ550","TCAE-S-13",343000,89000,70400,51600,45200,39500,36500,34600,33100,32000,30000,29000,25700,23400,20400]
[null,"DOJ625","TCAE-S-14",618000,116000,99000,72700,63600,55600,51400,48700,46600,45000,42600,40700,36300,33000,28800]
[]
[{"$nulls":5},"rpm"]
[null,"Model",null,"static","dyn fwd",10,50,100,200,300,400,500,600,800,1000,1500,2000,3000,4000]
[null,"BJ95","TCAE-L-1",2500,{"v":1127,"d":"1,127"},570,415,365,320,300,280,270,260,245,234,205,186,162,148]
[null,"BJ125","TCAE-L-2",5780,{"v":2744,"d":"2,744"},{"v":1350,"d":"1,350"},980,860,730,710,660,630,610,580,550,485,440,385,350]
[null,"BJ150","TCAE-L-3",11564,{"v":4704,"d":"4,704"},{"v":2300,"d":"2,300"},1700,1450,1300,1200,1150,1100,1050,980,940,820,750,650,600]
[null,"BJ175","TCAE-L-4",15680,{"v":6713,"d":"6,713"},{"v":3650,"d":"3,650"},2650,2350,2050,1950,1800,1700,1650,1550,1500,1300,1200,1050,940]
[null,"BJ200","TCAE-L-5",23912,{"v":11172,"d":"11,172"},{"v":5500,"d":"5,500"},4000,3500,3050,2900,2700,2550,2500,2350,2250,1950,1800,1550,1400]
[null,"BJ225","TCAE-L-6",29694,{"v":14700,"d":"14,700"},{"v":7800,"d":"7,800"},5700,5000,4350,4150,3800,3650,3550,3350,3200,2800,2550,2200,2000]
[null,"BJ250","TCAE-L-7",42238,{"v":20678,"d":"20,678"},{"v":10600,"d":"10,600"},7800,6800,6000,5700,5200,5000,4850,4600,4400,3800,3450,3050,2750]
[null,"BJ300","TCAE-L-8",63112,{"v":29106,"d":"29,106"},{"v":14100,"d":"14,100"},10300,9000,7900,7500,6900,6700,6300,6100,5800,5100,4600,4000,3650]
[null,"DOJ350","TCAE-L-9",92000,23000,18100,13300,11600,10200,9400,8900,8500,8200,7800,7500,6520,6020,5260]
[null,"DOJ400","TCAE-L-10",142000,34000,26900,19800,17200,15000,14000,13200,12700,12200,11500,11000,9690,8900,7830]
[null,"DOJ450","TCAE-L-11",187000,49000,38300,28100,24600,21500,19900,18800,18000,17400,16400,15700,13800,12700,11100]
[null,"DOJ500","TCAE-L-12",260000,67000,52700,38700,33800,29600,27400,25800,24800,24000,22600,21700,19300,17500,15300]
[null,"DOJ550","TCAE-L-13",343000,89000,70400,51600,45200,39500,36500,34600,33100,32000,30000,29000,25700,23400,20400]
[null,"DOJ625","TCAE-L-14",618000,116000,99000,72700,63600,55600,51400,48700,46600,45000,42600,40700,36300,33000,28800]
[]
[{"$nulls":5},"rpm"]
[null,"Model",null,"dyn fwd","dyn rev",10,50,100,200,300,400,500,600,800,1000,1200,1500,1800,2000,2500,3000]
[null,"BC75","TCAE-V-00",null,null,{"v":264.87,"d":"265"},{"v":191.29500000000002,"d":"191"},{"v":166.77,"d":"167"},null,{"v":142.245,"d":"142"},null,null,{"v":119.682,"d":"120"},null,{"v":107.91000000000001,"d":"108"},{"v":98.71573971844953,"d":"99"},{"v":95.157,"d":"95"},{"v":85.7327469568261,"d":"86"},{"v":85.347,"d":"85"},{"v":75.21404673238152,"d":"75"}]
[null,"BC87","TCAE-V-0",null,null,{"v":412.02000000000004,"d":"412"},{"v":304.11,"d":"304"},{"v":264.87,"d":"265"},null,{"v":220.72500000000002,"d":"221"},null,null,{"v":186.39000000000001,"d":"186"},null,{"v":167.75100000000003,"d":"168"},null,{"v":150.09300000000002,"d":"150"},null,{"v":137.34,"d":"137"}]
[null,"BC100 ","TCAE-V-1",null,null,{"v":608.22,"d":"608"},{"v":451.26000000000005,"d":"451"},{"v":387.495,"d":"387"},null,{"v":323.73,"d":"324"},null,null,{"v":264.87,"d":"265"},null,{"v":237.40200000000002,"d":"237"},null,{"v":210.91500000000002,"d":"211"},{"v":192.21109285056582,"d":"192"}]
[null,"BC125","TCAE-V-2",null,null,{"v":1275.3,"d":"1,275"},{"v":902.5200000000001,"d":"903"},{"v":794.61,"d":"795"},null,{"v":662.1750000000001,"d":"662"},null,null,{"v":549.36,"d":"549"},null,{"v":490.5,"d":"491"},null,{"v":431.64000000000004,"d":"432"}]
[null,"BC150","TCAE-V-3",null,null,{"v":2109.15,"d":"2,109"},{"v":1569.6000000000001,"d":"1,570"},{"v":1343.97,"d":"1,344"},null,{"v":1128.15,"d":"1,128"},null,null,{"v":941.76,"d":"942"},null,{"v":853.47,"d":"853"},{"v":795.1313223577429,"d":"795"}]
[null,"BC175","TCAE-V-4",null,null,{"v":3139.2000000000003,"d":"3,139"},{"v":2354.4,"d":"2,354"},{"v":2079.7200000000003,"d":"2,080"},null,{"v":1765.8000000000002,"d":"1,766"},null,null,{"v":1520.5500000000002,"d":"1,521"},null,{"v":1373.4,"d":"1,373"}]
[null,"BC200","TCAE-V-5",null,null,{"v":5444.55,"d":"5,445"},{"v":3924,"d":"3,924"},{"v":3433.5,"d":"3,434"},null,{"v":2844.9,"d":"2,845"},null,null,{"v":2403.4500000000003,"d":"2,403"},null,{"v":2158.2000000000003,"d":"2,158"}]
[null,"DOX225","TCAE-V-6",null,null,{"v":9094.5,"d":"9,095"},{"v":6691.875,"d":"6,692"},{"v":5853.375,"d":"5,853"},{"v":5111.625,"d":"5,112"},{"v":4740.75,"d":"4,741"},{"v":4466.625,"d":"4,467"},{"v":4289.25,"d":"4,289"},{"v":4144.125,"d":"4,144"},{"v":3918.375,"d":"3,918"},{"v":3741,"d":"3,741"},{"v":3286.582637722584,"d":"3287"},{"v":3032.8684198783267,"d":"3033"},{"v":2825.5688098036007,"d":"2826"},{"v":2705.7739035006525,"d":"2706"},{"v":2452.0596856563952,"d":"2452"}]
[null,"DOX250","TCAE-V-7",null,null,{"v":12187.636363636364,"d":"12,188"},{"v":8940.363636363636,"d":"8,940"},{"v":7738.181818181818,"d":"7,738"},{"v":6853.818181818182,"d":"6,854"},{"v":6356.363636363636,"d":"6,356"},{"v":5997.090909090909,"d":"5,997"},{"v":5734.545454545455,"d":"5,735"},{"v":5527.272727272727,"d":"5,527"},{"v":5250.909090909091,"d":"5,251"},{"v":4974.545454545455,"d":"4,975"},{"v":4385.903055948789,"d":"4386"},{"v":4046.278570848561,"d":"4046"},{"v":3768.785161408161,"d":"3769"},{"v":3608.4264565769518,"d":"3608"}]
[null,"DOX300","TCAE-V-8",null,null,{"v":25062.06896551724,"d":"25,062"},{"v":18306.206896551725,"d":"18,306"},{"v":16017.931034482757,"d":"16,018"},{"v":13947.58620689655,"d":"13,948"},{"v":12857.931034482757,"d":"12,858"},{"v":12204.137931034482,"d":"12,204"},{"v":11768.275862068966,"d":"11,768"},{"v":11332.413793103447,"d":"11,332"},{"v":10678.620689655172,"d":"10,679"},{"v":10242.758620689654,"d":"10,243"},{"v":8929.70835148419,"d":"8930"},{"v":8227.921882601004,"d":"8228"},{"v":7654.520586484014,"d":"7655"}]
[null,"DOX350","TCAE-V-9",null,null,{"v":34153.913043478264,"d":"34,154"},{"v":25096.521739130436,"d":"25,097"},{"v":21888.695652173912,"d":"21,889"},{"v":19246.956521739132,"d":"19,247"},{"v":17737.391304347824,"d":"17,737"},{"v":16793.91304347826,"d":"16,794"},{"v":16039.130434782608,"d":"16,039"},{"v":15473.04347826087,"d":"15,473"},{"v":14718.260869565218,"d":"14,718"},{"v":14152.173913043478,"d":"14,152"},{"v":12329.912372250747,"d":"12330"},{"v":11378.428269446955,"d":"11378"}]
[null,"DOX390","TCAE-V-10",null,null,{"v":47470.58823529412,"d":"47,471"},{"v":34941.17647058824,"d":"34,941"},{"v":30352.941176470587,"d":"30,353"},{"v":26470.588235294115,"d":"26,471"},{"v":24705.882352941175,"d":"24,706"},{"v":23294.11764705882,"d":"23,294"},{"v":22411.764705882353,"d":"22,412"},{"v":21529.41176470588,"d":"21,529"},{"v":20294.11764705882,"d":"20,294"},{"v":19411.764705882353,"d":"19,412"},{"v":17037.772596624927,"d":"17038"}]
[null,"DOX440","TCAE-V-11",null,null,{"v":57164.17910447762,"d":"57,164"},{"v":41940.29850746269,"d":"41,940"},{"v":36716.417910447766,"d":"36,716"},{"v":32089.552238805973,"d":"32,090"},{"v":29701.492537313436,"d":"29,701"},{"v":28059.701492537315,"d":"28,060"},{"v":26865.671641791047,"d":"26,866"},{"v":25970.149253731346,"d":"25,970"},{"v":24477.61194029851,"d":"24,478"},{"v":23432.835820895525,"d":"23,433"},{"v":20549.86970217163,"d":"20550"}]
[null,"DOX490","TCAE-V-12",null,null,{"v":98320.89552238806,"d":"98,321"},{"v":72201.49253731343,"d":"72,201"},{"v":63059.701492537315,"d":"63,060"},{"v":55223.880597014926,"d":"55,224"},{"v":51119.40298507463,"d":"51,119"},{"v":48134.32835820896,"d":"48,134"},{"v":46268.656716417914,"d":"46,269"},{"v":44776.119402985074,"d":"44,776"},{"v":42164.17910447761,"d":"42,164"},{"v":40485.07462686567,"d":"40,485"}]
[null,"DOX550","TCAE-V-13",null,null,{"v":162948.31460674157,"d":"162,948"},{"v":119433.70786516853,"d":"119,434"},{"v":104620.22471910111,"d":"104,620"},{"v":91426.96629213482,"d":"91,427"},{"v":84483.14606741573,"d":"84,483"},{"v":80085.39325842696,"d":"80,085"},{"v":76613.48314606742,"d":"76,613"},{"v":74067.41573033707,"d":"74,067"},{"v":69438.202247191,"d":"69,438"},{"v":67123.59550561798,"d":"67,124"}]
[null,"DOX625","TCAE-V-14",null,null,{"v":247500,"d":"247,500"},{"v":181750,"d":"181,750"},{"v":159000,"d":"159,000"},{"v":139000,"d":"139,000"},{"v":128500,"d":"128,500"},{"v":121750,"d":"121,750"},{"v":116500,"d":"116,500"},{"v":112500,"d":"112,500"},{"v":106500,"d":"106,500"},{"v":101750,"d":"101,750"}]

{"sheet":" Daves scratchpad 1","index":14,"n_rows":52,"n_cols":34,"rows_kept":52,"hidden":true,"merged":[[2,1,2,11],[22,0,22,1],[22,5,22,6],[22,10,22,11],[22,15,22,16],[22,20,22,21],[22,25,22,26],[22,30,22,31],[43,2,43,5]]}
[]
[null,"OBJECTIVE: "]
[1,"Determine the optimum duty factor for TCAE based on real life failed coupling life"]
[]
[]
["Case 1 - Visy","PM3 turbo pump",{"$nulls":3},"Case 2 - Visy","PM6 turbo pump",{"$nulls":3},"Case 3 - CHH K1","Kiln 1 Fan 1",{"$nulls":3},"Case 4 - CHH K1","Kiln 6 Fan 8",{"$nulls":3},"Case 5 - CHH K1","Kiln7 Fan 7",{"$nulls":3},"Case 6 - CHH K1","Kiln 9 Fan 7",{"$nulls":3},"Case 7 - CHH K1","Kiln 10 Fan 3"]
["Motor",18.5,"kW",null,null,"Motor",22,"kW",null,null,"Motor",15,"kW",null,null,"Motor",15,"kW",null,null,"Motor",15,"kW",null,null,"Motor",15,"kW",null,null,"Motor",15,"kW"]
["speed",1440,"rpm",null,null,"speed",1450,"rpm",null,null,"speed",980,"rpm",null,null,"speed",980,"rpm",null,null,"speed",980,"rpm",null,null,"speed",980,"rpm",null,null,"speed",980,"rpm"]
["MSF",1.25,{"$nulls":3},"MSF",1.25,{"$nulls":3},"MSF",1.25,{"$nulls":3},"MSF",1.25,{"$nulls":3},"MSF",1.25,{"$nulls":3},"MSF",1.25,{"$nulls":3},"MSF",1.25]
["DCF",1.44,{"$nulls":3},"DCF",1.44,{"$nulls":3},"DCF",1.44,{"$nulls":3},"DCF",1.44,{"$nulls":3},"DCF",1.44,{"$nulls":3},"DCF",1.44,{"$nulls":3},"DCF",1.44]
["AF",0.95,{"$nulls":3},"AF",0.95,{"$nulls":3},"AF",0.95,{"$nulls":3},"AF",0.95,{"$nulls":3},"AF",0.95,{"$nulls":3},"AF",0.95,{"$nulls":3},"AF",0.95]
["Load capacity",{"v":0.8,"d":"80%"},{"$nulls":3},"Load capacity",{"v":0.8,"d":"80%"},{"$nulls":3},"Load capacity",{"v":0.8,"d":"80%"},{"$nulls":3},"Load capacity",{"v":0.8,"d":"80%"},{"$nulls":3},"Load capacity",{"v":0.8,"d":"80%"},{"$nulls":3},"Load capacity",{"v":0.8,"d":"80%"},{"$nulls":3},"Load capacity",{"v":0.8,"d":"80%"}]
["Original result","TCAE","Life hours","Life days",null,"Original result","TCAE","Life hours","Life days",null,"Original result","TCAE","Life hours","Life days",null,"Original result","TCAE","Life hours","Life days",null,"Original result","TCAE","Life hours","Life days",null,"Original result","TCAE","Life hours","Life days",null,"Original result","TCAE","Life hours","Life days"]
[null,"TCAE 1R",{"v":8842,"d":"8,842"},{"$f":"+C14/24","v":{"v":368.4166666666667,"d":"368"}},null,null,"TCAE 1R",{"v":5328,"d":"5,328"},222,null,null,"TCAE 1R",{"$nulls":4},"TCAE 1R",{"$nulls":4},"TCAE 1R",{"$nulls":4},"TCAE 1R",{"$nulls":4},"TCAE 1R"]
[null,"TCAE 2R",{"v":139678,"d":"139,678"},{"$f":"+C15/24","v":{"v":5819.916666666667,"d":"5,820"}},null,null,"TCAE 2R",{"v":84192,"d":"84,192"},{"v":3508,"d":"3,508"},null,null,"TCAE 2R",{"$nulls":4},"TCAE 2R",{"$nulls":4},"TCAE 2R",{"$nulls":4},"TCAE 2R",{"$nulls":4},"TCAE 2R"]
[]
["Actual service history",{"$nulls":4},"Actual service history",{"$nulls":4},"Actual service history",{"$nulls":4},"Actual service history",{"$nulls":4},"Actual service history",{"$nulls":4},"Actual service history",{"$nulls":4},"Actual service history"]
["Model installed",{"$f":"+B14","v":"TCAE 1R"},{"$nulls":3},"Model installed",{"$f":"+G14","v":"TCAE 1R"},{"$nulls":3},"Model installed",{"$f":"+L14","v":"TCAE 1R"},{"$nulls":3},"Model installed",{"$f":"+Q14","v":"TCAE 1R"},{"$nulls":3},"Model installed",{"$f":"+V14","v":"TCAE 1R"},{"$nulls":3},"Model installed",{"$f":"+AA14","v":"TCAE 1R"},{"$nulls":3},"Model installed",{"$f":"+AF14","v":"TCAE 1R"}]
["Installed ","2016-12-13",{"$nulls":3},"Installed ","2017-01-01",{"$nulls":3},"Installed ","2017-01-05",{"$nulls":3},"Installed ","2017-01-05",{"$nulls":3},"Installed ","2017-01-06",{"$nulls":3},"Installed ","2016-11-07",{"$nulls":3},"Installed ","2017-01-05"]
["Failed","2019-01-01",{"$nulls":3},"Failed","2018-05-28",{"$nulls":3},"Failed","2017-08-19",{"$nulls":3},"Failed","2018-03-06",{"$nulls":3},"Failed","2017-11-23",{"$nulls":3},"Failed","2017-06-21",{"$nulls":3},"Failed","2018-04-10"]
["Operation time",{"$f":"+B20-B19","v":749},{"$nulls":3},"Operation time",{"$f":"+G20-G19","v":512},{"$nulls":3},"Operation time",{"$f":"+L20-L19","v":226},{"$nulls":3},"Operation time",{"$f":"+Q20-Q19","v":425},{"$nulls":3},"Operation time",{"$f":"+V20-V19","v":321},{"$nulls":3},"Operation time",{"$f":"+AA20-AA19","v":226},{"$nulls":3},"Operation time",{"$f":"+AF20-AF19","v":460}]
[]
["Updated calculation results",null,"hours","days",null,"Updated calculation results",null,"hours","days",null,"Updated calculation results",null,"hours","days",null,"Updated calculation results",null,"hours","days",null,"Updated calculation results",null,"hours","days",null,"Updated calculation results",null,"hours","days",null,"Updated calculation results",null,"hours","days"]
["Load capacity",{"v":0.8,"d":"80%"},{"$nulls":3},"Load capacity",{"v":0.8,"d":"80%"},{"$nulls":3},"Load capacity",{"v":0.8,"d":"80%"},{"$nulls":3},"Load capacity",{"v":0.8,"d":"80%"},{"$nulls":3},"Load capacity",{"v":0.8,"d":"80%"},{"$nulls":3},"Load capacity",{"v":0.8,"d":"80%"},{"$nulls":3},"Load capacity",{"v":0.8,"d":"80%"}]
["REDUCED LIFE","TCAE-0-R",{"v":972.4156022800536,"d":"972"},{"v":40.5173167616689,"d":"41"},null,"REDUCED LIFE","TCAE-1-R",{"v":5821,"d":"5,821"},243,null,"REDUCED LIFE","TCAE-0-R",{"v":944.6524406451941,"d":"945"},{"v":39.360518360216425,"d":"39"},null,"REDUCED LIFE","TCAE-0-R",{"v":944.6524406451941,"d":"945"},{"v":39.360518360216425,"d":"39"},null,"REDUCED LIFE","TCAE-0-R",{"v":944.6524406451941,"d":"945"},{"v":39.360518360216425,"d":"39"},null,"REDUCED LIFE","TCAE-0-R",{"v":944.6524406451941,"d":"945"},{"v":39.360518360216425,"d":"39"},null,"REDUCED LIFE","TCAE-0-R",{"v":944.6524406451941,"d":"945"},{"v":39.360518360216425,"d":"39"}]
["RECOMMENDED","TCAE-1-R",{"v":9645.823947505127,"d":"9,646"},{"v":401.90933114604695,"d":"402"},null,"RECOMMENDED","TCAE-2-R",{"v":91866,"d":"91,866"},{"v":3828,"d":"3,828"},null,"RECOMMENDED","TCAE-1-R",{"v":8916.807317398849,"d":"8,917"},{"v":371.533638224952,"d":"372"},null,"RECOMMENDED","TCAE-1-R",{"v":8916.807317398849,"d":"8,917"},{"v":371.533638224952,"d":"372"},null,"RECOMMENDED","TCAE-1-R",{"v":8916.807317398849,"d":"8,917"},{"v":371.533638224952,"d":"372"},null,"RECOMMENDED","TCAE-1-R",{"v":8916.807317398849,"d":"8,917"},{"v":371.533638224952,"d":"372"},null,"RECOMMENDED","TCAE-1-R",{"v":8916.807317398849,"d":"8,917"},{"v":371.533638224952,"d":"372"}]
["EXTENDED LIFE","TCAE-2-R",{"v":152373.68477593124,"d":"152,374"},{"v":6348.903532330468,"d":"6,349"},null,"EXTENDED LIFE","TCAE-3-R",{"v":426637.4120803756,"d":"426,637"},{"v":17776.558836682318,"d":"17,777"},null,"EXTENDED LIFE","TCAE-2-R",{"v":130952.02360149057,"d":"130,952"},{"v":5456.334316728774,"d":"5,456"},null,"EXTENDED LIFE","TCAE-2-R",{"v":130952.02360149057,"d":"130,952"},{"v":5456.334316728774,"d":"5,456"},null,"EXTENDED LIFE","TCAE-2-R",{"v":130952.02360149057,"d":"130,952"},{"v":5456.334316728774,"d":"5,456"},null,"EXTENDED LIFE","TCAE-2-R",{"v":130952.02360149057,"d":"130,952"},{"v":5456.334316728774,"d":"5,456"},null,"EXTENDED LIFE","TCAE-2-R",{"v":130952.02360149057,"d":"130,952"},{"v":5456.334316728774,"d":"5,456"}]
["Load capacity",{"v":0.7,"d":"70%"},{"$nulls":3},"Load capacity",{"v":0.7,"d":"70%"},{"$nulls":3},"Load capacity",{"v":0.85,"d":"85%"},{"$nulls":3},"Load capacity",{"v":0.75,"d":"75%"},{"$nulls":3},"Load capacity",{"v":0.85,"d":"85%"},{"$nulls":3},"Load capacity",{"v":0.85,"d":"85%"},{"$nulls":3},"Load capacity",{"v":0.75,"d":"75%"}]
["REDUCED LIFE","TCAE-0-R",{"v":1451.5358261439883,"d":"1,452"},{"v":60.48065942266618,"d":"60"},null,"REDUCED LIFE","TCAE-1-R",{"v":8688.524263592892,"d":"8,689"},{"v":362.0218443163705,"d":"362"},null,"REDUCED LIFE","TCAE-1-R",{"v":7434.000157147508,"d":"7,434"},{"v":309.7500065478128,"d":"310"},null,"REDUCED LIFE","TCAE-0-R",{"v":1146.4581916689526,"d":"1,146"},{"v":47.76909131953969,"d":"48"},null,"REDUCED LIFE","TCAE-1-R",{"v":7434.000157147508,"d":"7,434"},{"v":309.7500065478128,"d":"310"},null,"REDUCED LIFE","TCAE-1-R",{"v":7434.000157147508,"d":"7,434"},{"v":309.7500065478128,"d":"310"},null,"REDUCED LIFE","TCAE-0-R",{"v":1146.4581916689526,"d":"1,146"},{"v":47.76909131953969,"d":"48"}]
["RECOMMENDED","TCAE-1-R",{"v":14398.431081990164,"d":"14,398"},{"v":599.9346284162568,"d":"600"},null,"RECOMMENDED","TCAE-2-R",{"v":137128.88551935548,"d":"137,129"},{"v":5713.703563306478,"d":"5,714"},null,"RECOMMENDED","TCAE-2-R",{"v":109175.5523451467,"d":"109,176"},{"v":4548.981347714446,"d":"4,549"},null,"RECOMMENDED","TCAE-1-R",{"v":10821.70156209353,"d":"10,822"},{"v":450.90423175389714,"d":"451"},null,"RECOMMENDED","TCAE-2-R",{"v":109175.5523451467,"d":"109,176"},{"v":4548.981347714446,"d":"4,549"},null,"RECOMMENDED","TCAE-2-R",{"v":109175.5523451467,"d":"109,176"},{"v":4548.981347714446,"d":"4,549"},null,"RECOMMENDED","TCAE-1-R",{"v":10821.70156209353,"d":"10,822"},{"v":450.90423175389714,"d":"451"}]
["EXTENDED LIFE","TCAE-2-R",{"v":227449.93179380998,"d":"227,450"},{"v":9477.08049140875,"d":"9,477"},null,"EXTENDED LIFE","TCAE-3-R",{"v":636846.5159916981,"d":"636,847"},{"v":26535.27149965409,"d":"26,535"},null,"EXTENDED LIFE","TCAE-3-R",{"v":474731.5588069073,"d":"474,732"},{"v":19780.481616954472,"d":"19,780"},null,"EXTENDED LIFE","TCAE-2-R",{"v":158927.2559027275,"d":"158,927"},{"v":6621.96899594698,"d":"6,622"},null,"EXTENDED LIFE","TCAE-3-R",{"v":474731.5588069073,"d":"474,732"},{"v":19780.481616954472,"d":"19,780"},null,"EXTENDED LIFE","TCAE-3-R",{"v":474731.5588069073,"d":"474,732"},{"v":19780.481616954472,"d":"19,780"},null,"EXTENDED LIFE","TCAE-2-R",{"v":158927.2559027275,"d":"158,927"},{"v":6621.96899594698,"d":"6,622"}]
["Load capacity",{"v":0.65,"d":"65%"},{"$nulls":3},"Load capacity",{"v":0.62,"d":"62%"},{"$nulls":3},"Load capacity",{"v":0.95,"d":"95%"},{"$nulls":3},"Load capacity",{"v":0.76,"d":"76%"},{"$nulls":3},"Load capacity",{"v":0.86,"d":"86%"},{"$nulls":3},"Load capacity",{"v":0.94,"d":"94%"},{"$nulls":3},"Load capacity",{"v":0.74,"d":"74%"}]
["REDUCED LIFE","TCAE-0-R",{"v":1812.9332302863456,"d":"1,813"},{"v":75.5388845952644,"d":"76"},null,"REDUCED LIFE","TCAE-0-R",{"v":1259.6330456896567,"d":"1,260"},{"v":52.48471023706903,"d":"52"},null,"REDUCED LIFE","TCAE-1-R",{"v":5324.864086902711,"d":"5,325"},{"v":221.86933695427965,"d":"222"},null,"REDUCED LIFE","TCAE-0-R",{"v":1101.7961109726714,"d":"1,102"},{"v":45.908171290527974,"d":"46"},null,"REDUCED LIFE","TCAE-1-R",{"v":7702.673419629716,"d":"7,703"},{"v":320.94472581790484,"d":"321"},null,"REDUCED LIFE","TCAE-1-R",{"v":5496,"d":"5,496"},229,null,"REDUCED LIFE","TCAE-0-R",{"v":1193.5671372138358,"d":"1,194"},{"v":49.731964050576494,"d":"50"}]
["RECOMMENDED","TCAE-1-R",{"v":17983.29307645926,"d":"17,983"},{"v":749.3038781858025,"d":"749"},null,"RECOMMENDED","TCAE-1-R",{"v":12504.463690428156,"d":"12,504"},{"v":521.0193204345065,"d":"521"},null,"RECOMMENDED","TCAE-2-R",{"v":78200.82937333515,"d":"78,201"},{"v":3258.367890555631,"d":"3,258"},null,"RECOMMENDED","TCAE-1-R",{"v":10400.125169731851,"d":"10,400"},{"v":433.3385487388271,"d":"433"},null,"RECOMMENDED","TCAE-2-R",{"v":113121.28159074881,"d":"113,121"},{"v":4713.386732947867,"d":"4,713"},null,"RECOMMENDED","TCAE-2-R",{"v":80723,"d":"80,723"},{"v":3363,"d":"3,363"},null,"RECOMMENDED","TCAE-1-R",{"v":11266.374515103276,"d":"11,266"},{"v":469.4322714626365,"d":"469"}]
["EXTENDED LIFE","TCAE-2-R",{"v":284079.47785262374,"d":"284,079"},{"v":11836.644910525989,"d":"11,837"},null,"EXTENDED LIFE","TCAE-2-R",{"v":197354.9382915097,"d":"197,355"},{"v":8223.122428812903,"d":"8,223"},null,"EXTENDED LIFE","TCAE-3-R",{"v":340043.1766173402,"d":"340,043"},{"v":14168.465692389174,"d":"14,168"},null,"EXTENDED LIFE","TCAE-2-R",{"v":152735.99486979505,"d":"152,736"},{"v":6363.99978624146,"d":"6,364"},null,"EXTENDED LIFE","TCAE-3-R",{"v":491888.8999438034,"d":"491,889"},{"v":20495.370830991807,"d":"20,495"},null,"EXTENDED LIFE","TCAE-3-R",{"v":351011,"d":"351,011"},{"v":14625,"d":"14,625"},null,"TCAE-0-R","TCAE-2-R",{"v":165457.71248485576,"d":"165,458"},{"v":6894.071353535656,"d":"6,894"}]
{"$rows_empty":8}
[null,null,"Summary"]
[null,null,"Case #","Plant","Type","%load factor"]
[null,null,1,"Visy","pump",{"$f":"+B32","v":{"v":0.65,"d":"65%"}}]
[null,null,2,"Visy","pump",{"$f":"+G32","v":{"v":0.62,"d":"62%"}}]
[null,null,7,"CHH K10F3","fan ",{"$f":"+AF32","v":{"v":0.74,"d":"74%"}}]
[null,null,4,"CHH K6F8","fan ",{"$f":"+Q32","v":{"v":0.76,"d":"76%"}}]
[null,null,5,"CHH K7F7","fan ",{"$f":"+V32","v":{"v":0.86,"d":"86%"}}]
[null,null,6,"CHH K9F7","fan ",{"$f":"+AA32","v":{"v":0.94,"d":"94%"}}]
[null,null,3,"CHH K1F1","fan ",{"$f":"+L32","v":{"v":0.95,"d":"95%"}}]

{"sheet":"Daves scratchpad 3","index":15,"n_rows":75,"n_cols":18,"rows_kept":75,"hidden":true,"merged":[[2,8,2,11],[16,3,16,6],[16,14,16,17],[57,3,57,6]]}
[]
[null,"Detailed look at TCAE-S series sizes"]
[{"$nulls":8},"BORE SIZE ABLE TO FIT MOTOR SIZE Kw"]
[null,"Model  S",{"$nulls":3},"COUPLING OD","Bore max",null,"2P","4P","6P","8P"]
[null,"TCAE-6","BC225F",16170,4753,244,60,null,55,45,30,22]
[null,"TCAE-7","BC240F",22187,6527,240,80,null,150,110,75,55]
[null,"TCAE-8","BC287F",38328,11270,287,90,null,185,185,"132 / 110",90]
[null,"TCAE-9","BC350F",60868,17905,366,130,null,null,450,260]
[null,"TCAE-10","BC410F",90856,26725,410,145,null,900,1100,900,710]
[null,"TCAE-11","BC450F",129360,38053,460,180,null,900,1100,900,710]
[null,"TCAE-12","BC500F",177449,52195,500,200,null,900,1100,900,710]
[null,"TCAE-13","BC550F",236190,69462,504,190,null,900,1100,900,710]
[null,"TCAE-14","BC600F",441980,125440,625,250,null,900,1100,900,710]
[]
[null,"Electric motor shaft diameters"]
[]
[{"$nulls":3},"LOW VOLTAGE MOTOR POWER kW",{"$nulls":10},"LOW VOLTAGE MOTOR POWER HP"]
[null,"FRAME","DIAMETER","2P (2800 rpm)","4P (1440 rpm)","6P (935rpm)","8P (720rpm)",{"$nulls":5},"FRAME NEMA","DIAMETER mm","2P (3600 rpm)","4P (1800 rpm)","6P (1200rpm)","8P (900rpm)"]
[null,80,19,"0.75 / 1.1","0.55 / 0.75","0.37 / 0.55",0.18,{"$nulls":5},42,0.375]
[null,"90S",24,1.5,1.1,0.75,0.37,{"$nulls":5},48,0.5]
[null,"90L",24,2.2,1.5,1.1,0.55,{"$nulls":5},56,0.625]
[null,"100L",28,3,"2.2 / 3",1.5,"0.75 / 1.1",{"$nulls":5},"143T",0.875,1.5,1]
[null,"112M",28,4,4,2.2,1.5,{"$nulls":5},"145T",0.875,"1.5 / 3","1.5  /  2",1]
[null,"132S",38,"5.5 / 7.5",5.5,3,2.2,{"$nulls":5},182,0.875]
[null,"132M",38,null,7.5,"4 / 5.5",3,{"$nulls":5},184,0.875]
[null,"160M",42,"11 / 15",11,7.5,"4 / 5.5",{"$nulls":5},"182T",1.125,5,3,1.5]
[null,"160L",42,18.5,15,11,7.5,{"$nulls":5},"184T",1.125,"5 / 7.5",5,2]
[null,"180MA",48,22,{"$nulls":8},213,1.125]
[null,"180MC",48,null,18.5,{"$nulls":7},215,1.125]
[null,"180LC",48,null,22,15,11,{"$nulls":5},"213T",1.375,"10 / 15",7.5,3]
[null,"200LA",55,"30 / 37",{"$nulls":8},"215T",1.375,null,10,5]
[null,"200LC",55,null,30,"18.5 / 22",15,{"$nulls":5},"254U",1.375]
[null,"225SC",60,null,37,null,18.5,{"$nulls":5},"256U",1.375]
[null,"225MA",55,45,{"$nulls":8},"254T",1.625,20,15,7.5]
[null,"225MC",60,null,45,30,22,{"$nulls":5},"256T",1.625,25,20,10]
[null,"250SA",60,55,{"$nulls":8},"284U",1.625]
[null,"250SC",70,null,55,37,30,{"$nulls":5},"286U",1.625]
[null,"250MA",60,75,{"$nulls":8},"284T",1.875,null,25,15]
[null,"250MC",70,null,75,45,37,{"$nulls":5},"286T",1.875,null,30,20]
[null,"280SA",65,90,{"$nulls":8},"284TS",1.625,30]
[null,"280SC",80,null,90,55,45,{"$nulls":5},"286TS",1.625,40]
[null,"280MA",65,110,{"$nulls":8},"324U",1.875]
[null,"280MC",80,null,110,75,55,{"$nulls":5},"326U",1.875]
[null,"315SA",65,132,{"$nulls":8},"324T",2.125,null,40,25]
[null,"315SC",85,null,132,90,75,{"$nulls":5},"326T",2.125,null,50,30]
[null,"315MA",65,"150 / 185",{"$nulls":8},"324TS",1.875,50]
[null,"315MC",85,null,150,"110 / 132",90,{"$nulls":5},"326TS",1.875,60]
[null,"315M",85,null,185,{"$nulls":7},364,2.125]
[null,"315MC**",95,null,185,{"$nulls":7},365,2.125]
[null,"315AC",110,null,null,"150 / 185",{"$nulls":6},"364T",2.375,null,60,40]
[null,"315CC",110,null,"220 / 250",220,{"$nulls":6},"365T",2.375,null,75,50]
[null,"315DC",125,null,"300 / 375",260,{"$nulls":6},"364TS",1.875,75]
[null,"355CC",125,null,450,{"$nulls":7},"365TS",1.875,100]
[null,"400JH",110,"500 / 560 / 630","500 / 560 / 630","400 / 450 / 500 / 560","355 / 400 / 450 /500",{"$nulls":5},"404U",2.375]
[null,"450 LK",130,null,"710 / 800",630,{"$nulls":6},"405U",2.375]
[null,"450 JH",130,null,null,"710 / 800 / 900","560 / 630",{"$nulls":5},"404T",2.875,null,100,60]
[{"$nulls":12},"405T",2.875,null,125,75]
[{"$nulls":3},"HIGH VOLTAGE MOTOR POWER kW",{"$nulls":8},"404TS",2.125,125]
[null,"FRAME","DIAMETER","2P (2800 rpm)","4P (1440 rpm)","6P (935rpm)","8P (720rpm)",{"$nulls":5},"405TS",2.125,150]
[null,"315 HG",90,"160 / 185 / 200 / 220 / 250","150 / 160 / 185 / 200 / 220 / 250 /280","110 / 132 / 150 / 160 / 185 / 200","132 / 160",{"$nulls":5},"444U",2.875]
[null,"355 JH",100,"280 / 315 / 355","315 / 355 /400","220 / 250 / 280","185 / 220 / 250 / 280",{"$nulls":5},"445U",2.875]
[null,"400 LK",110,400,"450 / 500","315 / 355 / 400",355,{"$nulls":5},"444T",3.375,null,150,100]
[null,"400 JH",110,"450 / 500 / 560","450 / 500","450 / 500","400 / 450",{"$nulls":5},"445T",3.375,null,200,"125  /  150"]
[null,"450 LK",130,null,"630 / 660 / 710","560 / 590 / 630","500 / 560",{"$nulls":5},"447T",3.375,null,250,200]
[null,"450 JH",130,"630 / 710 / 800 / 900","750 / 800 / 900 / 1000 / 1100","660 / 710 / 750 / 800 / 900","630 / 710",{"$nulls":5},"449T",3.375,null,"300  /  350  /  400","250  /  300"]
[{"$nulls":12},"444TS",2.375,200]
[{"$nulls":12},"445TS",2.375,"250  /  300"]
[{"$nulls":12},"447TS",2.375,350]
[{"$nulls":12},"449TS",2.375,"400  /  450  /  500"]
[{"$nulls":12},"5009B",3.875,null,"450  /  500","350  /  400  /  450  /  500"]
[{"$nulls":12},"5011A",3.375,600]
[{"$nulls":12},"5011B",3.875,null,"600  /  700",600]
[{"$nulls":12},"5012A",2.875,"700  /  800"]
[{"$nulls":12},"5012B",3.875,null,800]
[{"$nulls":12},"5810B",4.875,null,null,"700  /  800"]

{"sheet":"Daves scratchpad 4","index":16,"n_rows":58,"n_cols":18,"rows_kept":58,"hidden":true,"merged":[[49,13,49,14],[49,15,49,16],[50,13,50,14],[50,15,50,16],[51,13,51,14],[51,15,51,16],[52,13,52,14],[52,15,52,16],[53,13,53,14],[53,15,53,16],[54,13,54,14],[54,15,54,16],[55,13,55,14],[55,15,55,16],[56,13,56,14],[56,15,56,16],[57,13,57,14],[57,15,57,16]]}
["Calculation of BC coupling life"]
[]
[]
["Table of data determined from graph kg.m",{"$nulls":4},9.81]
[]
["Speed",10,50,100,250,600,1000,1500,2000,3000]
["BC68",18,13.5,12,10.2,8.6,7.8,6.9,6.3,5.4]
["BC75",27,19.5,17,14.5,12.2,11,9.7,8.7,7.5]
["BC87",42,31,27,22.5,19,17.1,15.3,14,12]
["BC100 ",62,46,39.5,33,27,24.2,21.5,19.5,16.7]
["BC125",130,92,81,67.5,56,50,44,40,34]
["BC150",215,160,137,115,96,87,79,72,61]
["BC175",320,240,212,180,155,140,125,115,100]
["BC200",555,400,350,290,245,220,194,175,150]
[]
["Table of data determined from graph N.m"]
[]
["Speed",10,50,100,250,600,1000,1500,2000,3000]
["BC68",{"$f":"+B7*$F$4","v":{"v":176.58,"d":"177"}},{"$f":"+C7*$F$4","v":{"v":132.435,"d":"132"}},{"$f":"+D7*$F$4","v":{"v":117.72,"d":"118"}},{"v":100.062,"d":"100"},{"v":84.366,"d":"84"},{"v":76.518,"d":"77"},{"v":67.68900000000001,"d":"68"},{"v":61.803000000000004,"d":"62"},{"v":52.974000000000004,"d":"53"}]
["BC75",{"$f":"+B8*$F$4","v":{"v":264.87,"d":"265"}},{"v":191.29500000000002,"d":"191"},{"v":166.77,"d":"167"},{"v":142.245,"d":"142"},{"v":119.682,"d":"120"},{"v":107.91000000000001,"d":"108"},{"v":95.157,"d":"95"},{"v":85.347,"d":"85"},{"v":73.575,"d":"74"}]
["BC87",{"v":412.02000000000004,"d":"412"},{"v":304.11,"d":"304"},{"v":264.87,"d":"265"},{"v":220.72500000000002,"d":"221"},{"v":186.39000000000001,"d":"186"},{"v":167.75100000000003,"d":"168"},{"v":150.09300000000002,"d":"150"},{"v":137.34,"d":"137"},{"v":117.72,"d":"118"}]
["BC100 ",{"v":608.22,"d":"608"},{"v":451.26000000000005,"d":"451"},{"v":387.495,"d":"387"},{"v":323.73,"d":"324"},{"v":264.87,"d":"265"},{"v":237.40200000000002,"d":"237"},{"v":210.91500000000002,"d":"211"},{"v":191.29500000000002,"d":"191"},{"v":163.827,"d":"164"}]
["BC125",{"v":1275.3,"d":"1275"},{"v":902.5200000000001,"d":"903"},{"v":794.61,"d":"795"},{"v":662.1750000000001,"d":"662"},{"v":549.36,"d":"549"},{"v":490.5,"d":"491"},{"v":431.64000000000004,"d":"432"},{"v":392.40000000000003,"d":"392"},{"v":333.54,"d":"334"}]
["BC150",{"v":2109.15,"d":"2109"},{"v":1569.6000000000001,"d":"1570"},{"v":1343.97,"d":"1344"},{"v":1128.15,"d":"1128"},{"v":941.76,"d":"942"},{"v":853.47,"d":"853"},{"v":774.99,"d":"775"},{"v":706.32,"d":"706"},{"v":598.4100000000001,"d":"598"}]
["BC175",{"v":3139.2000000000003,"d":"3139"},{"v":2354.4,"d":"2354"},{"v":2079.7200000000003,"d":"2080"},{"v":1765.8000000000002,"d":"1766"},{"v":1520.5500000000002,"d":"1521"},{"v":1373.4,"d":"1373"},{"v":1226.25,"d":"1226"},{"v":1128.15,"d":"1128"},981]
["BC200",{"v":5444.55,"d":"5445"},3924,{"v":3433.5,"d":"3434"},{"v":2844.9,"d":"2845"},{"v":2403.4500000000003,"d":"2403"},{"v":2158.2000000000003,"d":"2158"},{"v":1903.14,"d":"1903"},{"v":1716.75,"d":"1717"},{"v":1471.5,"d":"1472"}]
[]
[]
["Values based on upper and lower limits only"]
["Speed",10,1000,4000,null,"Speed",10,1000,4000]
["BC68",19,7.7,5,null,"BC68",{"$f":"+B31*$F$4","v":{"v":186.39000000000001,"d":"186"}},{"$f":"+C31*$F$4","v":{"v":75.537,"d":"76"}},{"v":49.050000000000004,"d":"49"}]
["BC75",27,11,7.1,null,"BC75",{"$f":"+B32*$F$4","v":{"v":264.87,"d":"265"}},{"v":107.91000000000001,"d":"108"},{"v":69.651,"d":"70"}]
["BC87",42,17,11,null,"BC87",{"v":412.02000000000004,"d":"412"},{"v":166.77,"d":"167"},{"v":107.91000000000001,"d":"108"}]
["BC100 ",62,25,16.3,null,"BC100 ",{"v":608.22,"d":"608"},{"v":245.25,"d":"245"},{"v":159.90300000000002,"d":"160"}]
["BC125",120,50,32.4,null,"BC125",{"v":1177.2,"d":"1177"},{"v":490.5,"d":"491"},{"v":317.844,"d":"318"}]
["BC150",210,85,56,null,"BC150",{"v":2060.1,"d":"2060"},{"v":833.85,"d":"834"},{"v":549.36,"d":"549"}]
["BC175",325,130,85,null,"BC175",{"v":3188.25,"d":"3188"},{"v":1275.3,"d":"1275"},{"v":833.85,"d":"834"}]
["BC200",550,220,145,null,"BC200",{"v":5395.5,"d":"5396"},{"v":2158.2000000000003,"d":"2158"},{"v":1422.45,"d":"1422"}]
{"$rows_empty":9}
[{"$nulls":12},"FINAL EQUATIONS"]
[]
[{"$nulls":11},"rpm","Model","speed 10-1000",null,"speed 1000-4000",null,"rpm"]
[{"$nulls":11},1000,"BC68",{"$f":"292.79*L51^-0.196","v":{"v":75.60599612159034,"d":"76"}},null,{"$f":"649.46*R51^-0.311","v":{"v":75.77961738964129,"d":"76"}},null,1000]
[{"$nulls":12},"BC75",{"$f":"414.97*L51^-0.195","v":{"v":107.89882139266929,"d":"108"}},null,{"$f":"956.05*R51^-0.316","v":{"v":107.76571279765969,"d":"108"}}]
[{"$nulls":12},"BC87",{"$f":"647.62*L51^-0.196","v":{"v":167.2323344658777,"d":"167"}},null,{"$f":"1459.4*R51^-0.314","v":{"v":166.7916641792193,"d":"167"}}]
[{"$nulls":12},"BC100 ",{"$f":"957.83*L51^-0.197","v":{"v":245.63397446977655,"d":"246"}},null,{"$f":"2066.3*R51^-0.309","v":{"v":244.4518766594908,"d":"244"}}]
[{"$nulls":12},"BC125",{"$f":"1823.7*L51^-0.19","v":{"v":490.8552021921517,"d":"491"}},null,{"$f":"4261.3*R51^-0.313","v":{"v":490.39056974089243,"d":"490"}}]
[{"$nulls":12},"BC150",{"$f":"3238.1*L51^-0.196","v":{"v":836.1616723293885,"d":"836"}},null,{"$f":"6670.2*R51^-0.301","v":{"v":833.947778335824,"d":"834"}}]
[{"$nulls":12},"BC175",{"$f":"5041.1*L51^-0.199","v":{"v":1275.044412988466,"d":"1275"}},null,{"$f":"10594*R51^-0.306","v":{"v":1279.557976912123,"d":"1280"}}]
[{"$nulls":12},"BC200",{"$f":"8531*L51^-0.199","v":{"v":2157.7441207682064,"d":"2158"}},null,{"$f":"17229*R51^-0.301","v":{"v":2154.071283162111,"d":"2154"}}]