{"text_format":"3","workbook":"xlsx","n_sheets":17,"sheets":["Data Entry","Model tables","Calculations","Formulae","Daves pad 6 (Shikar mod)","Shikar scratchpad 5","Shikar scratchpad 5 (Dave mod)","Daves scratchpad 2","R series life","S series life","L series life","V series life","Basic life graph","Chart1"," Daves scratchpad 1","Daves scratchpad 3","Daves scratchpad 4"],"not_rendered":{"charts":45,"images":8,"external_links":2,"defined_names":52,"comments":1},"unopened":[{"sheet":"R series life","index":8,"reason":"not_a_worksheet"},{"sheet":"S series life","index":9,"reason":"not_a_worksheet"},{"sheet":"L series life","index":10,"reason":"not_a_worksheet"},{"sheet":"V series life","index":11,"reason":"not_a_worksheet"},{"sheet":"Chart1","index":13,"reason":"not_a_worksheet"}],"read":"whole","date_system":"1900"}

{"sheet":"Data Entry","index":0,"n_rows":62,"n_cols":38,"rows_kept":62,"merged":[[0,0,58,0],[0,1,0,11],[0,12,4,12],[0,13,1,22],[0,23,24,23],[0,24,0,26],[0,27,61,28],[0,29,1,29],[0,30,0,31],[0,35,0,36],[0,37,1,37],[1,1,1,3],[1,9,1,11],[2,2,2,3],[2,9,2,11],[2,13,2,14],[2,15,2,18],[2,20,2,21],[2,22,3,22],[3,2,3,3],[3,9,3,11],[3,13,3,14],[3,15,3,18],[3,20,3,21],[4,2,4,3],[4,9,4,11],[4,13,4,22],[5,1,5,22],[6,1,7,4],[6,5,7,5],[6,6,7,14],[6,15,7,15],[6,16,7,21],[6,22,7,22],[8,1,9,4],[8,5,21,5],[8,6,9,9],[8,10,21,10],[8,11,9,14],[8,15,21,15],[8,16,9,19],[8,20,21,20],[8,21,21,21],[8,22,21,22],[10,1,15,3],[10,4,14,4],[10,6,15,9],[10,11,17,14],[10,16,17,19],[10,29,11,29],[10,30,10,31],[12,32,19,32],[13,24,17,26],[15,4,16,4],[16,2,16,3],[16,6,18,7],[16,8,18,8],[16,9,18,9],[18,11,19,11],[18,12,19,12],[18,13,19,13],[18,14,21,14],[18,16,18,17],[18,18,18,19],[18,25,57,26],[19,4,21,4],[19,6,19,7],[19,16,19,17],[19,18,19,19],[20,6,20,7],[20,16,20,17],[20,18,20,19],[20,29,21,29],[20,30,20,31],[21,6,21,7],[21,16,21,17],[21,18,21,19],[21,24,24,24],[22,1,22,22],[22,32,27,32],[23,1,23,19],[23,20,23,22],[24,1,24,22],[25,1,25,24],[26,1,26,3],[26,4,26,6],[26,7,26,9],[26,10,26,12],[26,13,26,16],[26,17,26,20],[26,21,26,24],[27,1,27,3],[27,4,27,6],[27,7,27,9],[27,10,27,12],[27,13,27,16],[27,17,27,20],[27,21,27,24],[28,1,28,3],[28,4,28,6],[28,7,28,9],[28,10,28,12],[28,13,28,16],[28,17,28,20],[28,21,28,24],[28,29,29,29],[28,30,28,31],[29,1,29,3],[29,4,29,6],[29,7,29,9],[29,10,29,12],[29,13,29,16],[29,17,29,20],[29,21,29,24],[29,30,29,31],[30,1,30,3],[30,4,30,6],[30,7,30,9],[30,10,30,12],[30,13,30,16],[30,17,30,20],[30,21,30,24],[30,30,30,31],[31,1,31,3],[31,4,31,6],[31,7,31,9],[31,10,31,12],[31,13,31,16],[31,17,31,20],[31,21,31,24],[31,30,31,31],[32,1,32,3],[32,4,32,6],[32,7,32,9],[32,10,32,12],[32,13,32,16],[32,17,32,20],[32,21,32,24],[32,30,32,31],[33,1,33,3],[33,4,33,6],[33,7,33,9],[33,10,33,12],[33,13,33,16],[33,17,33,20],[33,21,33,24],[33,30,33,31],[34,1,34,3],[34,4,34,6],[34,7,34,9],[34,10,34,12],[34,13,34,16],[34,17,34,20],[34,21,34,24],[34,30,34,31],[35,1,35,3],[35,4,35,6],[35,7,35,9],[35,10,35,12],[35,13,35,16],[35,17,35,20],[35,21,35,24],[35,30,35,31],[36,1,36,3],[36,4,36,6],[36,7,36,9],[36,10,36,12],[36,13,36,16],[36,17,36,20],[36,21,36,24],[36,30,36,31],[37,1,58,3],[37,4,37,6],[37,7,37,9],[37,10,37,12],[37,13,37,16],[37,17,37,20],[37,21,37,24],[37,30,37,31],[38,4,38,6],[38,7,38,9],[38,10,38,12],[38,13,38,16],[38,17,38,20],[38,21,38,24],[38,30,38,31],[39,4,57,6],[39,7,39,9],[39,10,39,12],[39,13,39,16],[39,17,39,20],[39,21,39,24],[39,30,39,31],[40,7,40,9],[40,10,40,12],[40,13,40,16],[40,17,40,20],[40,21,40,24],[40,30,40,31],[41,7,41,9],[41,10,41,12],[41,13,41,16],[41,17,41,20],[41,21,41,24],[41,30,41,31],[42,7,42,9],[42,10,42,12],[42,13,42,16],[42,17,42,20],[42,21,42,24],[42,30,42,31],[43,7,43,9],[43,10,43,12],[43,13,43,16],[43,17,43,20],[43,21,43,24],[43,30,43,31],[44,7,44,9],[44,10,44,12],[44,13,44,16],[44,17,44,20],[44,21,44,24],[44,29,45,29],[44,30,44,31],[44,35,45,35],[45,7,45,9],[45,10,45,12],[45,13,45,16],[45,17,45,20],[45,21,57,24],[46,7,46,9],[46,10,46,12],[46,13,46,16],[46,17,46,20],[47,7,47,9],[47,10,47,12],[47,13,47,16],[47,17,47,20],[48,7,48,9],[48,10,48,12],[48,13,48,16],[48,17,48,20],[49,7,49,9],[49,10,49,12],[49,13,49,16],[49,17,49,20],[50,7,50,9],[50,10,57,12],[50,13,50,16],[50,17,50,20],[51,7,57,9],[51,13,51,16],[51,17,57,20],[52,13,52,16],[53,13,53,16],[54,13,54,16],[54,35,61,35],[55,13,55,16],[56,13,56,16],[57,13,57,16],[58,4,58,26],[59,0,62,26]]}
[null,"SERVICE LIFE CALCULATION",{"$nulls":22},"Document Revision History",{"$nulls":4},"TCAE-R SERIES","DBSE",null,"Weight","Dia","DBSE","Shaft Size / \nBore Size ",null,"To Suit\nTaperlock Size"]
[{"$nulls":4},"SELECTED",null,"LIFE HOURS","FIT FOR USE","MAX RPM","DBSE RANGE [mm]",{"$nulls":14},"A","Draft release","06/12/2019",{"$nulls":3},"min","max","[kg]","[mm]","range","[mm]","[in]"]
[null,{"$f":"IF(E3=\"\", \"\",\"OPTION 1\")","v":""},{"$f":"IF(B3=\"\",\"\",\"Meets all input criteria\")","v":""},null,{"$f":"IF(OR(TYPE=\"CLICK HERE\",D18=\"CLICK HERE\",D20=\"CLICK HERE\",MSF=\"CLICK HERE\"),\"\",IF('Model tables'!C29=\"-\",\"\",'Model tables'!C29))","v":""},null,{"$f":"IF(OR(TYPE=\"CLICK HERE\",D18=\"CLICK HERE\",D20=\"CLICK HERE\",MSF=\"CLICK HERE\"),\"\",IF('Model tables'!C29=\"-\",\"\",IF('Model tables'!D29*hourpa>=25000, \"25,000\",'Model tables'!D29*hourpa)))","v":""},{"$f":"IF(G3=\"\",\"\",IF(AND(G3/hourpa>=1,G3/hourpa<2),\" 1-2 yrs\",IF(AND(G3/hourpa>=2,G3/hourpa<3),\" 2-3 yrs\",\"> 3 yrs\")))","v":""},{"$f":"IF(G3=\"\",\"\",IFERROR(INDEX('Model tables'!E16:E31,MATCH('Data Entry'!E3,'Model tables'!C16:C31,0)),\"-\"))","v":""},{"$f":"IFERROR(INDEX(AI1:AI62,MATCH(E3,AD1:AD62,0)),\"\")","v":""},{"$nulls":3},"Customer Name:",{"$nulls":5},"Date:",{"$nulls":4},"B","Warranty period formula changed","2019-12-19",null,null,"TCAE-R-1",{"$f":"'Model tables'!H12","v":130},{"$f":"'Model tables'!I12","v":140},{"$f":"'Model tables'!L12","v":{"v":1.8999999999999995,"d":"2"}},{"$f":"'Model tables'!M12","v":148},{"$f":"CONCATENATE('Model tables'!N12,\" (\",AE3,\"-\",AF3,\")\")","v":"135 (130-140)"},"16 to 65","0.625 to 2.5","#2517"]
[null,{"$f":"IF(E4=\"\", \"\",IF(B3=\"OPTION 1\", \"OPTION 2\",\"OPTION 1\"))","v":""},{"$f":"IF(B4=\"\",\"\",IF(E4='Model tables'!C16,\"Meets all input criteria\",IF(E4='Model tables'!C18,\"Meets all input criteria\",\"DBSE change required\")))","v":""},null,{"$f":"IF(OR(TYPE=\"CLICK HERE\",D18=\"CLICK HERE\",D20=\"CLICK HERE\",MSF=\"CLICK HERE\"),\"\",IF('Model tables'!C30=\"-\",\"\",'Model tables'!C30))","v":""},null,{"$f":"IF(OR(TYPE=\"CLICK HERE\",D18=\"CLICK HERE\",D20=\"CLICK HERE\",MSF=\"CLICK HERE\"),\"\",IF('Model tables'!C30=\"-\",\"\",IF('Model tables'!D30*hourpa>=25000, \"25,000\",'Model tables'!D30*hourpa)))","v":""},{"$f":"IF(G4=\"\",\"\",IF(AND(G4/hourpa>=1,G4/hourpa<2),\" 1-2 yrs\",IF(AND(G4/hourpa>=2,G4/hourpa<3),\" 2-3 yrs\",\"> 3 yrs\")))","v":""},{"$f":"IF(G4=\"\",\"\",IFERROR(INDEX('Model tables'!E16:E316,MATCH('Data Entry'!E4,'Model tables'!C16:C31,0)),\"-\"))","v":""},{"$f":"IFERROR(INDEX(AI1:AI62,MATCH(E4,AD1:AD62,0)),\"\")","v":""},{"$nulls":3},"Distributor Name:",{"$nulls":5},"Ref #:",{"$nulls":4},"C","Procedure page","2019-12-23",null,null,"TCAE-R-2",{"$f":"'Model tables'!H13","v":155},{"$f":"'Model tables'!I13","v":175},{"$f":"'Model tables'!L13","v":{"v":9.899999999999999,"d":"10"}},{"$f":"'Model tables'!M13","v":178},{"$f":"CONCATENATE('Model tables'!N13,\" (\",AE4,\"-\",AF4,\")\")","v":"165 (155-175)"},"16 to 65","0.62 to 2.5","#2517"]
[null,{"$f":"IF(E5=\"\",\"\",IF(B4=\"OPTION 1\",\"OPTION 2\",IF(B4=\"OPTION 2\",\"OPTION 3\",IF(B3=\"OPTION 1\",\"OPTION 2\",\"OPTION 1\"))))","v":""},{"$f":"IF(B5=\"\",\"\",IF(E5='Model tables'!C16,\"Meets all input criteria\",IF(E5='Model tables'!C18,\"Meets all input criteria\",\"DBSE change required\")))","v":""},null,{"$f":"IF(OR(TYPE=\"CLICK HERE\",D18=\"CLICK HERE\",D20=\"CLICK HERE\",MSF=\"CLICK HERE\"),\"\",IF('Model tables'!C31=\"-\",\"\",'Model tables'!C31))","v":""},null,{"$f":"IF(OR(TYPE=\"CLICK HERE\",D18=\"CLICK HERE\",D20=\"CLICK HERE\",MSF=\"CLICK HERE\"),\"\",IF('Model tables'!C31=\"-\",\"\",IF('Model tables'!D31*hourpa>=25000, \"25,000\",'Model tables'!D31*hourpa)))","v":""},{"$f":"IF(G5=\"\",\"\",IF(AND(G5/hourpa>=1,G5/hourpa<2),\" 1-2 yrs\",IF(AND(G5/hourpa>=2,G5/hourpa<3),\" 2-3 yrs\",\"> 3 yrs\")))","v":""},{"$f":"IF(G5=\"\",\"\",IFERROR(INDEX('Model tables'!E16:E31,MATCH('Data Entry'!E5,'Model tables'!C16:C31,0)),\"-\"))","v":""},{"$f":"IFERROR(INDEX(AI1:AI62,MATCH(E5,AD1:AD62,0)),\"\")","v":""},{"$nulls":14},2,"Released","2019-12-30",null,null,"TCAE-R-3",{"$f":"'Model tables'!H14","v":285},{"$f":"'Model tables'!I14","v":305},{"$f":"'Model tables'!L14","v":{"v":20.5,"d":"21"}},{"$f":"'Model tables'!M14","v":215},{"$f":"CONCATENATE('Model tables'!N14,\" (\",AE5,\"-\",AF5,\")\")","v":"295 (285-305)"},"25 to 75","1.0 to 3.0","#3020"]
[null,"Message Bar:",{"$nulls":22},3,"Fixed error in R series","2020-01-19",null,null,"TCAE-R-4",{"$f":"'Model tables'!H15","v":285},{"$f":"'Model tables'!I15","v":305},{"$f":"'Model tables'!L15","v":{"v":28.3,"d":"28"}},{"$f":"'Model tables'!M15","v":253},{"$f":"CONCATENATE('Model tables'!N15,\" (\",AE6,\"-\",AF6,\")\")","v":"295 (285-305)"},"35 to 100","1.5 to 4.0","#3525"]
{"$rows_left_out":57}
{"sheet":"Model tables","index":1,"n_rows":136,"n_cols":36,"rows_kept":136,"hidden":true,"merged":[[1,23,1,35],[3,25,3,26],[3,29,3,30],[3,33,3,34],[7,6,8,6],[7,7,7,8],[7,9,8,9],[7,10,8,10],[7,20,8,20],[8,25,8,26],[9,0,9,1],[10,0,10,1],[11,0,11,1],[12,0,12,1],[13,25,13,26],[15,5,17,5],[18,25,18,26],[19,11,19,12],[23,6,23,7],[23,25,23,26],[24,31,24,32],[33,6,34,6],[33,8,34,8],[33,9,34,9],[33,20,34,20],[59,6,60,6],[59,7,59,8],[59,9,60,9],[59,10,60,10],[59,20,60,20],[81,6,81,7],[90,6,91,6],[90,7,90,8],[90,9,91,9],[90,10,91,10],[90,18,91,18],[106,6,106,7],[116,6,117,6],[116,7,116,8],[116,9,117,9],[116,10,117,10],[129,6,129,7]]}
["Model tables"]
["speed",{"$f":"Gearspeed","v":0},null,null,"Max service life",6,"yrs",{"$nulls":16},"FINAL SELECTION"]
[null,"years","hours","months"]
["service life period",{"v":1,"d":"1.0"},{"$f":"+hourpa*B4","v":0},{"$f":"B4*12","v":12},{"$nulls":20},"Arg 1",{"$f":"+IF(Y5=1,\"S Series Required\",\"-\")","v":"S Series Required"},{"$nulls":3},"check S series against life",{"$nulls":3},"check S series against shaft diam",null,"TCAE"]
["service life period",{"v":2,"d":"2.0"},{"$f":"+hourpa*B5","v":0},{"$f":"B5*12","v":24},{"$nulls":19},"\"S\" series",{"$f":"+IF(H30<>1,+IF(H56=1,1,0),0)","v":1},"Selected"]
["service life period",{"v":3,"d":"3.0"},{"$f":"+hourpa*B6","v":0},{"$f":"B6*12","v":36},{"$nulls":22},{"$f":"+IF(Y5=1,+IF(P33<=H36,G36,+IF(P33<=H37,G37,+IF(P33<=H38,G38,+IF(P33<=H39,G39,+IF(P33<=H40,G40,+IF(P33<=H41,G41,+IF(P33<=H42,G42,+IF(P33<=H43,G43,+IF(P33<=H44,G44,+IF(P33<=H45,G45,+IF(P33<=H46,G46,+IF(P33<=H47,G47,+IF(P33<=H48,G48,+IF(P33<=H49,G49,G50)))))))))))))))","v":"DOJ100"},"IDEAL",{"$f":"+VLOOKUP(AA6,G36:J49,4)","v":{"$error":"#DIV/0!"}},{"$f":"+IF(AC6<C5,\"Larger model required\",\"OK\")","v":{"$error":"#DIV/0!"}},null,{"$f":"+IF(AD6<>\"OK\",G52,AA6)","v":{"$error":"#DIV/0!"}},"IDEAL",{"$f":"+VLOOKUP(AF6,G36:J49,4)","v":{"$error":"#DIV/0!"}},{"$f":"+IF(+VLOOKUP(AF6,G36:H49,2)>=P33,\"OK\",\"check shaft diameter\")","v":{"$error":"#DIV/0!"}},{"$f":"+VLOOKUP(AF6,G36:I49,3)","v":{"$error":"#DIV/0!"}}]
{"$rows_left_out":131}
{"sheet":"Calculations","index":2,"n_rows":47,"n_cols":19,"rows_kept":47,"hidden":true,"merged":[[2,18,3,25],[3,6,3,7],[3,9,3,10],[3,12,3,13]]}
[]
[null,"2. Gather the data entry values to perform initial calculations",{"$nulls":13},"LISTS","Fomula",null,"Notes:"]
[null,"Power",{"$f":"+POWER","v":{"$error":"#VALUE!"}},"kW",null,null,"Tables for constants",{"$nulls":11},"- The diesel engine produces maximum torque at around 2,000rpm, whereas the petrol engine does this at over 4,000rpm\n"]
[null,"Speed",{"$f":"+SPEED","v":0},"rpm",null,null,"Machine service factor K1",null,null,"Time factor K2",null,null,"Angle factor K3",null,null,"Power Source","BHP to kW"]
[null,"Gear ratio",{"$f":"+IF(+RATIO=0,1,+RATIO)","v":1},{"$nulls":3},"Motor type","K1m",null,"hpd","K2",null,"Angle ","K3",null,"CLICK HERE",null,null,"- For frequent start/stop, or reversing loads, use K1d factor of 2, or higher"]
[null,"output speed",{"$f":"+C4/C5","v":0},"rpm",null,null,"CLICK HERE",null,null,0,0,null,0,0.99,null,"kW",null,null,"- for applications > 2000rpm,use only nitrile rubber boots"]
{"$rows_left_out":42}
{"sheet":"Formulae","index":3,"n_rows":114,"n_cols":26,"rows_kept":114,"hidden":true,"merged":[[8,23,8,25]]}
["Calculation of coupling type from data entry page"]
["final speed",{"$f":"+output_speed","v":0},"rpm"]
["operational hours",{"$f":"+Calculations!C11","v":0},"hpd"]
["equiv torque ",{"$f":"+Calculations!C47","v":{"$error":"#VALUE!"}},"Nm"]
["service life period",{"$f":"'Model tables'!B4","v":{"v":1,"d":"1.0"}},"year",{"$f":"+hourpa*Formulae!B5","v":0},"hrs"]
["service life period",{"$f":"'Model tables'!B5","v":{"v":2,"d":"2.0"}},"years",{"$f":"+hourpa*Formulae!B6","v":0},"hrs"]
{"$rows_left_out":109}
{"sheet":"Daves pad 6 (Shikar mod)","index":4,"n_rows":67,"n_cols":35,"rows_kept":67,"hidden":true,"merged":[[1,17,2,17],[2,19,2,21],[3,6,3,9],[3,11,3,13],[3,19,3,21]]}
["Daves scratchpad 6"]
[{"$nulls":11},{"$f":"1.25^3","v":1.953125},{"$nulls":5},"Agreed by team"]
["Proposal to use unfactored POWER values to define couplings",{"$nulls":18},"Dave - Initial Calc"]
[null,null,"Power  kW at MSF 1",{"$nulls":3},"Power kW at MSF 1.25",{"$nulls":4},"TORQUE Nm",{"$nulls":3},"ACTIVE\nCELL",null,"Max Speed",null,"Power kW at MSF 1.25"]
[null,null,"1000 rpm","1500 rpm ","3000 rpm","max rpm","1000 rpm","1500 rpm ","3000 rpm","max rpm","3000 rpm",1000,1500,3000,"max",{"$nulls":4},"1000 rpm","1500 rpm ","3000 rpm"]
["BJ095 - R","TCAE-R-1",{"$f":"1000*L6/9549","v":{"v":24.05559810019482,"d":"24"}},{"$f":"1500*M6/9549","v":{"v":33.218865907594925,"d":"33"}},{"$f":"3000*N6/9549","v":{"v":57.677267619335986,"d":"58"}},null,{"$f":"+C6/$L$2","v":{"v":12.316466227299749,"d":"12"}},{"$f":"IF(R6>=1500,+D6/$L$2,\"-\")","v":{"v":17.0080593446886,"d":"17"}},{"$f":"IF(R6>=3000,+E6/$L$2,\"-\")","v":{"v":29.530761021100023,"d":"30"}},"-",null,{"v":229.70690625876034,"d":"230"},{"v":211.4713003677493,"d":"211"},{"v":183.58674283234643,"d":"184"},null,{"$f":"Formulae!$O$29","v":{"v":229.70690625876034,"d":"230"}},null,{"$f":"Formulae!I19","v":3600},null,{"v":12.288,"d":"12"},{"v":16.128,"d":"16"},{"v":25.6,"d":"26"}]
{"$rows_left_out":62}
{"sheet":"Shikar scratchpad 5","index":5,"n_rows":109,"n_cols":28,"rows_kept":109,"hidden":true,"merged":[[1,1,1,11],[3,1,3,6],[4,2,4,3],[4,5,4,7],[4,18,4,27],[30,1,30,7],[31,2,31,3],[31,4,31,17],[41,17,49,17],[69,20,69,21],[69,24,69,25],[70,16,70,17],[70,20,70,21],[70,24,70,25],[71,16,71,17],[71,20,71,21],[71,24,71,25],[72,16,72,17],[72,20,72,21],[72,24,72,25],[73,16,73,17],[73,20,73,21],[73,24,73,25],[74,16,74,17],[74,20,74,21],[75,16,75,17],[75,20,75,21],[76,16,76,17],[76,20,76,21],[76,24,76,25],[77,16,77,17],[77,20,77,21],[78,16,78,17],[78,20,78,21],[79,16,79,17],[79,20,79,21],[79,24,79,25],[80,16,80,17],[80,20,80,21],[81,16,81,17],[81,20,81,21],[82,16,82,17],[82,20,82,21],[83,16,83,17],[83,20,83,21],[84,1,84,6],[88,0,96,0],[100,0,108,0]]}
[null,"OBJECTIVE: "]
[2,"Determine the correlation between Service life data and strength data for BJ and DOJ to apply to BCF models"]
[]
[null,"DOX Series comparison of dynamic torque to life torques"]
[null,null,"limit",null,null,"formulas",{"$nulls":4},"Rule 1","Rule 2","Rule 3",{"$nulls":5},"rpm"]
[null,"Model","static","dyn ",null,"static ","dyn",{"$nulls":3},"static/dyn","dynn+1/dynn","dynn/dynn-1",null,"Model","static","dyn fwd","dyn rev",10,50,100,200,300,400,500,600,800,1000]
{"$rows_left_out":75}
{"sheet":"Shikar scratchpad 5 (Dave mod)","index":6,"n_rows":109,"n_cols":28,"rows_kept":109,"hidden":true,"merged":[[1,1,1,11],[3,1,3,6],[4,2,4,3],[4,5,4,7],[4,18,4,27],[21,16,27,16],[21,17,21,18],[21,19,21,20],[21,22,21,23],[21,24,21,25],[22,17,22,18],[22,19,22,20],[22,22,22,23],[22,24,22,25],[23,17,23,18],[23,19,23,20],[23,22,23,23],[23,24,23,25],[24,17,24,18],[24,19,24,20],[24,22,24,23],[24,24,24,25],[25,17,25,18],[25,19,25,20],[25,22,25,23],[25,24,25,25],[26,17,26,18],[26,19,26,20],[26,22,26,23],[26,24,26,25],[27,17,27,18],[27,19,27,20],[27,22,27,23],[27,24,27,25],[28,17,28,18],[30,1,30,7],[31,2,31,3],[31,4,31,17],[41,17,49,17],[69,20,69,21],[69,24,69,25],[70,16,70,17],[70,20,70,21],[70,24,70,25],[71,16,71,17],[71,20,71,21],[71,24,71,25],[72,16,72,17],[72,20,72,21],[72,24,72,25],[73,16,73,17],[73,20,73,21],[73,24,73,25],[74,16,74,17],[74,20,74,21],[75,16,75,17],[75,20,75,21],[76,16,76,17],[76,20,76,21],[76,24,76,25],[77,16,77,17],[77,20,77,21],[78,16,78,17],[78,20,78,21],[79,16,79,17],[79,20,79,21],[79,24,79,25],[80,16,80,17],[80,20,80,21],[81,16,81,17],[81,20,81,21],[82,16,82,17],[82,20,82,21],[83,16,83,17],[83,20,83,21],[84,1,84,6],[88,0,96,0],[100,0,108,0]]}
[null,"OBJECTIVE: "]
[2,"Determine the correlation between Service life data and strength data for BJ and DOJ to apply to BCF models"]
[]
[null,"DOX Series comparison of dynamic torque to life torques"]
[null,null,"limit",null,null,"formulas",{"$nulls":4},"Rule 1","Rule 2","Rule 3",{"$nulls":5},"rpm"]
[null,"Model","static","dyn ",null,"static ","dyn",{"$nulls":3},"static/dyn","dynn+1/dynn","dynn/dynn-1",null,"Model","static","dyn fwd","dyn rev",10,50,100,200,300,400,500,600,800,1000]
{"$rows_left_out":83}
{"sheet":"Daves scratchpad 2","index":7,"n_rows":123,"n_cols":32,"rows_kept":123,"hidden":true,"merged":[[1,1,1,11],[3,1,3,6],[4,5,4,7],[4,18,4,31],[35,16,41,16],[35,17,35,18],[35,19,35,20],[35,22,35,23],[35,24,35,25],[36,17,36,18],[36,19,36,20],[36,22,36,23],[36,24,36,25],[37,17,37,18],[37,19,37,20],[37,22,37,23],[37,24,37,25],[38,17,38,18],[38,19,38,20],[38,22,38,23],[38,24,38,25],[39,17,39,18],[39,19,39,20],[39,22,39,23],[39,24,39,25],[40,17,40,18],[40,19,40,20],[40,22,40,23],[40,24,40,25],[41,17,41,18],[41,19,41,20],[41,22,41,23],[41,24,41,25],[42,17,42,18],[44,1,44,6],[45,4,45,17],[55,17,63,17],[83,20,83,21],[83,24,83,25],[84,16,84,17],[84,20,84,21],[84,24,84,25],[85,16,85,17],[85,20,85,21],[85,24,85,25],[86,16,86,17],[86,20,86,21],[86,24,86,25],[87,16,87,17],[87,20,87,21],[87,24,87,25],[88,16,88,17],[88,20,88,21],[89,16,89,17],[89,20,89,21],[90,16,90,17],[90,20,90,21],[90,24,90,25],[91,16,91,17],[91,20,91,21],[92,16,92,17],[92,20,92,21],[93,16,93,17],[93,20,93,21],[93,24,93,25],[94,16,94,17],[94,20,94,21],[95,16,95,17],[95,20,95,21],[96,16,96,17],[96,20,96,21],[97,16,97,17],[97,20,97,21],[98,1,98,6],[102,0,110,0],[114,0,122,0]]}
[null,"OBJECTIVE: "]
[2,"Determine the correlation between Service life data and strength data for BJ and DOJ to apply to BCF models"]
[]
[null,"BJ-D Series comparison of dynamic torque to life torques"]
[{"$nulls":5},"formulas",{"$nulls":5},"Rule 1","Rule 2",{"$nulls":5},"rpm"]
[null,"Model","static","dyn rev","dyn fwd","static ","dyn fwd","dyn rev",null,"rev/static","fwd/static","Dyn fwd","Dyn rev",null,"Model","static","dyn fwd","dyn rev",10,50,100,200,300,400,500,600,800,1000,1500,2000,3000,4000]
{"$rows_left_out":87}
{"sheet":"Basic life graph","index":12,"n_rows":68,"n_cols":21,"rows_kept":68,"hidden":true,"merged":[[2,5,2,18],[13,5,13,18],[23,18,31,18],[33,5,33,18],[50,5,50,20]]}
[]
[]
[{"$nulls":5},"rpm"]
[null,"Model",null,"static","dyn fwd",10,50,100,200,300,400,500,600,800,1000,1500,2000,3000,4000]
[null,"BJ95","TCAE-R-1",2500,{"v":1127,"d":"1,127"},570,415,365,320,300,280,270,260,245,234,205,186,162,148]
[null,"BJ125","TCAE-R-2",5780,{"v":2744,"d":"2,744"},{"v":1350,"d":"1,350"},980,860,730,710,660,630,610,580,550,485,440,385,350]
{"$rows_left_out":63}
{"sheet":" Daves scratchpad 1","index":14,"n_rows":52,"n_cols":34,"rows_kept":52,"hidden":true,"merged":[[2,1,2,11],[22,0,22,1],[22,5,22,6],[22,10,22,11],[22,15,22,16],[22,20,22,21],[22,25,22,26],[22,30,22,31],[43,2,43,5]]}
[]
[null,"OBJECTIVE: "]
[1,"Determine the optimum duty factor for TCAE based on real life failed coupling life"]
[]
[]
["Case 1 - Visy","PM3 turbo pump",{"$nulls":3},"Case 2 - Visy","PM6 turbo pump",{"$nulls":3},"Case 3 - CHH K1","Kiln 1 Fan 1",{"$nulls":3},"Case 4 - CHH K1","Kiln 6 Fan 8",{"$nulls":3},"Case 5 - CHH K1","Kiln7 Fan 7",{"$nulls":3},"Case 6 - CHH K1","Kiln 9 Fan 7",{"$nulls":3},"Case 7 - CHH K1","Kiln 10 Fan 3"]
{"$rows_left_out":40}
{"sheet":"Daves scratchpad 3","index":15,"n_rows":75,"n_cols":18,"rows_kept":75,"hidden":true,"merged":[[2,8,2,11],[16,3,16,6],[16,14,16,17],[57,3,57,6]]}
[]
[null,"Detailed look at TCAE-S series sizes"]
[{"$nulls":8},"BORE SIZE ABLE TO FIT MOTOR SIZE Kw"]
[null,"Model  S",{"$nulls":3},"COUPLING OD","Bore max",null,"2P","4P","6P","8P"]
[null,"TCAE-6","BC225F",16170,4753,244,60,null,55,45,30,22]
[null,"TCAE-7","BC240F",22187,6527,240,80,null,150,110,75,55]
{"$rows_left_out":70}
{"sheet":"Daves scratchpad 4","index":16,"n_rows":58,"n_cols":18,"rows_kept":58,"hidden":true,"merged":[[49,13,49,14],[49,15,49,16],[50,13,50,14],[50,15,50,16],[51,13,51,14],[51,15,51,16],[52,13,52,14],[52,15,52,16],[53,13,53,14],[53,15,53,16],[54,13,54,14],[54,15,54,16],[55,13,55,14],[55,15,55,16],[56,13,56,14],[56,15,56,16],[57,13,57,14],[57,15,57,16]]}
["Calculation of BC coupling life"]
[]
[]
["Table of data determined from graph kg.m",{"$nulls":4},9.81]
[]
["Speed",10,50,100,250,600,1000,1500,2000,3000]
{"$rows_left_out":44}