{"text_format":"3","workbook":"xlsx","n_sheets":7,"sheets":["Data Entry","Calculations","Formulas","Model tables","Chart1","Daves scratchpad 2"," Daves scratchpad 1"],"not_rendered":{"charts":26,"images":5,"defined_names":21,"comments":2},"unopened":[{"sheet":"Chart1","index":4,"reason":"not_a_worksheet"}],"read":"whole","date_system":"1900"}

{"sheet":"Data Entry","index":0,"n_rows":41,"n_cols":36,"rows_kept":41,"merged":[[0,2,0,11],[0,13,0,14],[0,15,0,18],[0,20,0,22],[0,23,0,25],[0,31,1,31],[0,32,0,33],[0,34,0,35],[1,13,1,14],[1,15,1,18],[2,4,2,8],[3,11,6,19],[3,21,4,21],[4,1,4,3],[5,1,5,3],[5,21,6,21],[6,1,6,3],[8,1,9,4],[8,6,9,9],[8,11,9,14],[8,16,9,19],[11,31,12,31],[11,32,11,33],[11,34,11,35],[16,6,18,7],[16,8,18,8],[16,9,18,9],[17,2,17,3],[18,11,19,11],[18,12,19,12],[18,13,19,13],[18,16,18,17],[18,18,18,19],[19,6,19,7],[19,16,19,17],[19,18,19,19],[20,6,20,7],[20,16,20,17],[20,18,20,19],[21,6,21,7],[21,16,21,17],[21,18,21,19],[22,31,23,31],[22,32,22,33],[22,34,22,35],[30,31,31,31]]}
[null,null,"DATA ENTRY FOR SIZING OF TCAE COUPLINGS",{"$nulls":10},"Customer Name:",{"$nulls":5},"Date:",{"$nulls":3},"Document Revision History",{"$nulls":7},"TCAE R MODEL","DBSE mm",null,"DBSE inches"]
[{"$nulls":13},"Distributor Name:",{"$nulls":9},"A","Draft release","2019-12-06",{"$nulls":6},"Min","Max","Min","Max"]
[{"$nulls":4},"DESIGN LIFE CALCULATION",{"$nulls":18},"B","warranty period formula changed","2019-12-19",{"$nulls":5},"TCAE-0-R",82,90,{"$f":"AG3/25.4","v":{"v":3.2283464566929134,"d":"3.23"}},{"$f":"AH3/25.4","v":{"v":3.5433070866141736,"d":"3.54"}}]
[{"$nulls":4},"SELECTED",null,"HOURS","DAYS","YEARS",null,null,"The DBSE (Minimum and Maximum) for our TCAE-R; TCAE-L and TCAE-CM Series Couplings are listed in the columns AF-AH on the right.  We make smaller DBSE's with our TCAE-S Range but these are to order.  If you don't fit to our normal DBSE sizes, can you move your motor or driven shaft.  Print and send to us or call +61405 970 995.",{"$nulls":9},"YES",null,"C","Procedure page","2019-12-23",{"$nulls":5},"TCAE-1-R",130,147,{"$f":"AG4/25.4","v":{"v":5.118110236220473,"d":"5.12"}},{"$f":"AH4/25.4","v":{"v":5.78740157480315,"d":"5.79"}}]
[null,"REDUCED LIFE",null,null,{"$f":"IF('Model tables'!AD28=1,'Model tables'!AO28,+IF('Model tables'!AD33=1,'Model tables'!AF33,+IF('Model tables'!AD38=1,'Model tables'!AF38,+IF('Model tables'!AD43=1,'Model tables'!AF43))))","v":{"$error":"#DIV/0!"}},null,{"$f":"IF('Model tables'!AD28=1,'Model tables'!AM28,+IF('Model tables'!AD33=1,'Model tables'!AH33,+IF('Model tables'!AD38=1,'Model tables'!AH38,+IF('Model tables'!AD43=1,'Model tables'!AH43))))","v":{"$error":"#DIV/0!"}},{"$f":"G5/hours","v":{"$error":"#DIV/0!"}},{"$f":"+G5/hourpa","v":{"$error":"#DIV/0!"}},{"$nulls":14},2,"Releasaed","2019-12-30",{"$nulls":5},"TCAE-2-R",136,162,{"v":5.354330708661418,"d":"5.35"},{"v":6.377952755905512,"d":"6.38"}]
[null,"RECOMMENDED",null,null,{"$f":"IF('Model tables'!AD28=1,'Model tables'!AO29,+IF('Model tables'!AD33=1,'Model tables'!AF34,+IF('Model tables'!AD38=1,'Model tables'!AF39,+IF('Model tables'!AD43=1,'Model tables'!AF44))))","v":{"$error":"#DIV/0!"}},null,{"$f":"IF(IF('Model tables'!Z32=1,'Model tables'!AI32,+IF('Model tables'!Z37=1,'Model tables'!AD37,+IF('Model tables'!Z42=1,'Model tables'!AD42,+IF('Model tables'!Z47=1,'Model tables'!AD47))))<hourpa*4,IF('Model tables'!Z32=1,'Model tables'!AI32,+IF('Model tables'!Z37=1,'Model tables'!AD37,+IF('Model tables'!Z42=1,'Model tables'!AD42,+IF('Model tables'!Z47=1,'Model tables'!AD47)))),hourpa*4)","v":0},{"$f":"+G6/hours","v":{"$error":"#DIV/0!"}},{"$f":"+G6/hourpa","v":{"$error":"#DIV/0!"}},{"$nulls":12},"NO",null,3,"fixed error in R series","2020-01-19",{"$nulls":5},"TCAE-3-R",240,270,{"v":9.448818897637796,"d":"9.45"},{"v":10.62992125984252,"d":"10.63"}]
[null,"EXTENDED LIFE",null,null,{"$f":"IF('Model tables'!AD28=1,'Model tables'!AO30,+IF('Model tables'!AD33=1,'Model tables'!AF35,+IF('Model tables'!AD38=1,'Model tables'!AF40,+IF('Model tables'!AD43=1,'Model tables'!AF45))))","v":{"$error":"#DIV/0!"}},null,{"$f":"IF(IF('Model tables'!Z32=1,'Model tables'!AI32,+IF('Model tables'!Z37=1,'Model tables'!AD37,+IF('Model tables'!Z42=1,'Model tables'!AD42,+IF('Model tables'!Z47=1,'Model tables'!AD47))))<hourpa*5,IF('Model tables'!Z32=1,'Model tables'!AI32,+IF('Model tables'!Z37=1,'Model tables'!AD37,+IF('Model tables'!Z42=1,'Model tables'!AD42,+IF('Model tables'!Z47=1,'Model tables'!AD47)))),hourpa*5)","v":0},{"$f":"+G7/hours","v":{"$error":"#DIV/0!"}},{"$f":"+G7/hourpa","v":{"$error":"#DIV/0!"}},{"$nulls":14},4,"Changed Layout","2020-04-23",{"$nulls":5},"TCAE-4-R",276,285,{"v":10.866141732283465,"d":"10.87"},{"v":11.220472440944883,"d":"11.22"}]
[{"$nulls":23},5,"fixed error in R series","2020-05-07",{"$nulls":5},"TCAE-5-R",276,300,{"v":10.866141732283465,"d":"10.87"},{"v":11.811023622047244,"d":"11.81"}]
[null,"MOTOR DETAILS",{"$nulls":4},"DRIVEN SHAFT DETAILS",{"$nulls":4},"IF GEARBOX CONNECTED",{"$nulls":4},"MACHINE OPERATIONAL DUTY TIME",{"$nulls":6},6,"fixed error in R series","21/05/202o",{"$nulls":5},"TCAE-6-R",291,312,{"v":11.456692913385828,"d":"11.46"},{"v":12.283464566929135,"d":"12.28"}]
[{"$nulls":23},7,"mm & inches added","2020-05-23",{"$nulls":5},"TCAE-7-R",310,330,{"v":12.20472440944882,"d":"12.20"},{"v":12.992125984251969,"d":"12.99"}]
[{"$nulls":31},"TCAE-8-R",326,344,{"v":12.834645669291339,"d":"12.83"},{"v":13.543307086614174,"d":"13.54"}]
[{"$nulls":31},"TCAE L MODEL","DBSE",null,"DBSE"]
[{"$nulls":32},"Min","Max","Min","Max"]
[{"$nulls":31},"TCAE-0-L",90,1500,{"$f":"AG14/25.4","v":{"v":3.5433070866141736,"d":"3.54"}},{"$f":"AH14/25.4","v":{"v":59.05511811023622,"d":"59.06"}}]
[{"$nulls":31},"TCAE-1-L",147,1800,{"$f":"AG15/25.4","v":{"v":5.78740157480315,"d":"5.79"}},{"$f":"AH15/25.4","v":{"v":70.86614173228347,"d":"70.87"}}]
{"$rows_left_out":27}
{"sheet":"Calculations","index":1,"n_rows":50,"n_cols":18,"rows_kept":50,"hidden":true,"merged":[[3,6,3,7],[3,12,3,14],[21,6,21,7]]}
[]
[null,"2. Gather the data entry values to perform initial calculations",{"$nulls":14},"LISTS","Fomula"]
[null,"Power",{"$f":"+POWER","v":{"$error":"#VALUE!"}},"kW",null,null,"Tables for constants"]
[null,"Speed",{"$f":"+SPEED","v":0},"rpm",null,null,"Machine service factor K1",null,null," time factor K2",null,null,"Angle factor K3",{"$nulls":3},"Power Source","kw to BHP"]
[null,"Gear ratio",{"$f":"+IF(+RATIO=0,1,+RATIO)","v":1},{"$nulls":3},"Motor type","K1m",null,"hpd","K2",null,"Angle ","K3bjd","K3doj",null,"Click Here"]
[null,"output speed",{"$f":"+C4/C5","v":0},"rpm",null,null,"Click Here",null,null,2,0.63,null,0,0.99,0.99,null,"kW"]
[{"$nulls":6},"Diesel 3cyl or less",3,null,4,0.8,null,1,0.98,0.94,null,"BHP",{"$f":"ROUNDUP(IF('Data Entry'!D19=\"click Here\",\"\",IF('Data Entry'!D19=\"kW\",'Data Entry'!C19,IF('Data Entry'!D19=\"BHP\",'Data Entry'!C19/1.341,0))),1)","v":{"$error":"#VALUE!"}}]
[null,"Motor type",{"$f":"+TYPE","v":"Click Here"},{"$nulls":3},"Diesel 4+ cyl",2,null,6,0.91,null,2,0.96,0.89]
[{"$nulls":6},"Electric motor",1,null,8,1,null,3,0.94,0.85]
[null,"Machine type",{"$f":"+MSF","v":"Click Here"},{"$nulls":3},"Petrol 3cyl or less",1.5,null,10,1.08,null,4,0.92,0.82,null,"Size","mm to inches"]
[null,null,{"$f":"+hours","v":0},"hpd",null,null,"Petrol 4+cyl",1.25,null,12,1.15,null,5,0.9,0.78,null,"Motor shaft",{"$f":"ROUNDUP(IF('Data Entry'!D21=\"click Here\",0,IF('Data Entry'!D21=\"mm\",'Data Entry'!C21,IF('Data Entry'!D21=\"inches\",'Data Entry'!C21*25.4,0))),0)","v":0}]
[null,null,{"$f":"+days","v":0},"dpw",null,null,"Turbine",1,null,14,1.2,null,6,0.88,0.75,null,"gear shaft dia",{"$f":"ROUNDUP(IF('Data Entry'!N19=\"click Here\",0,IF('Data Entry'!N19=\"mm\",'Data Entry'!M19,IF('Data Entry'!N19=\"inches\",'Data Entry'!M19*25.4,0))),0)","v":0}]
[null,null,{"$f":"+weeks","v":0},"wpa",null,null,"Driven type","K1d",null,16,1.26,{"$nulls":5},"Driven shaft",{"$f":"ROUNDUP(IF('Data Entry'!J20=\"click Here\",0,IF('Data Entry'!J20=\"mm\",'Data Entry'!I20,IF('Data Entry'!J20=\"inches\",'Data Entry'!I20*25.4,0))),0)","v":0}]
[{"$nulls":6},"extreme shock",3,null,18,1.31,{"$nulls":5},"DBSE",{"$f":"ROUNDUP(IF('Data Entry'!J17=\"click Here\",0,IF('Data Entry'!J17=\"mm\",'Data Entry'!I17,IF('Data Entry'!J17=\"inches\",'Data Entry'!I17*25.4,0))),0)","v":0}]
[null,"Motor shaft",{"$f":"+DriveShaftdia.","v":0},"mm",null,null,"heavy duty",2,null,20,1.35]
{"$rows_left_out":36}
{"sheet":"Formulas","index":2,"n_rows":93,"n_cols":21,"rows_kept":93,"hidden":true,"merged":[[76,10,76,12]]}
["Calculation of coupling type from data entry page"]
["final speed",{"$f":"+output_speed","v":0},"rpm"]
["operational hours",{"$f":"+Calculations!C11","v":0},"hpd"]
["equiv torque BJD",{"$f":"+Calculations!C49","v":{"$error":"#VALUE!"}},"Nm"]
["equiv torque DOJ",{"$f":"+Calculations!C50","v":{"$error":"#VALUE!"}},"Nm",{"$nulls":3},"Initial selection","life hrs","life days","life yrs"]
["warranty period",1,"years",{"$f":"+hourpa*Formulas!B6","v":0},"hrs","LESSER",{"$f":"INDEX(A12:A29,MATCH(G7,A12:A29,0)-1,1)","v":{"$error":"#DIV/0!"}},{"$f":"+VLOOKUP(G6,A12:C29,3)","v":{"$error":"#DIV/0!"}},{"$f":"+H6/hours","v":{"$error":"#DIV/0!"}},{"$f":"+H6/(hourpa)","v":{"$error":"#DIV/0!"}}]
["warranty period",1,"years",{"$f":"+hourpa*Formulas!B7","v":0},"hrs","IDEAL",{"$f":"+IF(D7<C12,A12,+IF(D7<C13,A13,+IF(D7<C14,A14,+IF(D7<C15,A15,+IF(D7<C16,A16,+IF(D7<C17,A17,+IF(D7<C18,A18,+IF(D7<C19,A19,+IF(D7<C20,A20,+IF(D7<C21,A21,+IF(D7<C22,A22,+IF(D7<C23,A23,+IF(D7<C24,A24,+IF(D7<C25,A25,+IF(D7<C26,A26,+IF(D7<C27,A27,+IF(D7<C28,A28,+IF(D7<C29,A29,A30))))))))))))))))))","v":{"$error":"#DIV/0!"}},{"$f":"+VLOOKUP(G7,A12:C29,3)","v":{"$error":"#DIV/0!"}},{"$f":"+H7/hours","v":{"$error":"#DIV/0!"}},{"$f":"+H7/(hourpa)","v":{"$error":"#DIV/0!"}}]
["warranty period",1,"years",{"$f":"+hourpa*Formulas!B8","v":0},"hrs","GREATER",{"$f":"INDEX(A12:A29,MATCH(G7,A12:A29,0)+1,1)","v":{"$error":"#DIV/0!"}},{"$f":"+VLOOKUP(G8,A12:C29,3)","v":{"$error":"#DIV/0!"}},{"$f":"+H8/hours","v":{"$error":"#DIV/0!"}},{"$f":"+H8/(hourpa)","v":{"$error":"#DIV/0!"}}]
[]
["Calculated torque limit values at speed",{"$nulls":10},"Working torque vs speed"]
["Coupling","limit torque","life calc hrs",null,"torque ","at speed","torque ","at speed","max speed",null,"Coupling","range 0-1000 rpm",null,"equation","torque at","torque at","range 1000-4000 rpm",null,"equation","torque at"]
["BC75",{"$f":"IF(B2<1000,395.68*(B2^-0.187),1012.1*(B2^-0.329))","v":{"$error":"#DIV/0!"}},{"$f":"+(B12/$B$4)^3*7200","v":{"$error":"#DIV/0!"}},null,{"$f":"+L13","v":245},{"$f":"+M13","v":13},{"$f":"+O13","v":{"v":108.72867584995565,"d":"109"}},1000,3600,null,null,"Torque","Speed","0-1000 rpm",1000,10,"Torque","Speed","1000-4000 rpm",4000,"rpm"]
["BJ095",{"$f":"IF(B2<1000,940.1*(B2^-0.204),1661.6*(B2^-0.292))","v":{"$error":"#DIV/0!"}},{"$f":"+(B13/$B$4)^3*7200","v":{"$error":"#DIV/0!"}},null,{"$f":"+L16","v":588},{"$f":"+M16","v":10},{"$f":"+O16","v":{"v":229.70690625876034,"d":"230"}},1000,3600,null,"BC75",245,13,"y = 395.68x-0.187",{"$f":"395.68*(O12^-0.187)","v":{"v":108.72867584995565,"d":"109"}},{"$f":"395.68*(P12^-0.187)","v":{"v":257.24331587495413,"d":"257"}},98,1200,"y = 1012.1x-0.329",{"$f":"1012.1*(T12^-0.329)","v":{"v":66.09151203217603,"d":"66"}}]
["BJ125",{"$f":"IF(B2<1000,2019.8*(B2^-0.185),5699.8*(B2^-0.335))","v":{"$error":"#DIV/0!"}},{"$error":"#DIV/0!"},null,{"$f":"+L19","v":981},{"$f":"+M19","v":50},{"$f":"+O19","v":{"v":562.740753639841,"d":"563"}},1000,3600,null,null,147,200,{"$nulls":3},78,2400]
["BJ150",{"$f":"IF(B2<1000,3680.8*(B2^-0.201),6144.4*(B2^-0.275))","v":{"$error":"#DIV/0!"}},{"$error":"#DIV/0!"},null,{"$f":"+L22","v":1960},{"$f":"+M22","v":23},{"$f":"+O22","v":{"v":918.2104270931626,"d":"918"}},1000,3000]
{"$rows_left_out":79}
{"sheet":"Model tables","index":3,"n_rows":64,"n_cols":41,"rows_kept":64,"hidden":true,"merged":[[6,4,7,4],[6,5,6,6],[6,7,7,7],[6,8,7,8],[6,12,7,12],[6,13,6,14],[6,16,7,16],[6,21,6,22],[6,24,7,24],[6,31,7,31],[21,4,21,5],[21,12,21,13],[21,20,21,21],[26,0,26,1],[26,30,26,31],[27,0,27,1],[28,0,28,1],[29,0,29,1],[31,30,31,31],[36,30,36,31],[41,30,41,31],[47,9,47,12]]}
["Model tables"]
["From initial selection "]
["life reqd 1yr",{"$f":"+Formulas!D6","v":0},"hrs"]
["life reqd 1yr",{"$f":"+Formulas!D7","v":0},"hrs"]
["life reqd 1yr",{"$f":"+Formulas!D8","v":0},"hrs"]
[{"$nulls":4},"R series",{"$nulls":7},"L series",{"$nulls":7},"CM series",{"$nulls":7},"S series",{"$nulls":7},"HD Series"]
[{"$nulls":4},"Model","D.B.S.E. ",null,"TCAE MODEL","LIFE hrs","weight","dia",null,"Model","D.B.S.E. ",null,"TCAE MODEL","LIFE hrs","weight","dia",null,"Model","D.B.S.E. ",null,"TCAE MODEL","LIFE hrs","weight","dia",null,"Model","BORE d","TCAE MODEL","LIFE hrs","weight","dia"]
["Coupling","limit torque","life calc hrs",null,null,"min","max 1",null,null,"kgs","mm",null,null,"max 1","max 2",null,null,"kgs","mm",null,null,"max 1","max 2",null,null,"kgs","mm",null,null,"max ",null,null,"kgs","mm",null,null,"Model","TCAE","Speed Max"]
["BC75",{"v":85.94859282334248,"d":"86"},{"v":0.013234862433706189,"d":"0"},null,"BC75 - R",82,90,"TCAE-0-R",{"$f":"+Formulas!C12","v":{"$error":"#DIV/0!"}},{"v":3.9,"d":"4"},"117",null,"BC75 - L",90,1500,"TCAE-0-L",{"$f":"+Formulas!C12","v":{"$error":"#DIV/0!"}},"L dependant","117",null,"DOJ350 - CM",500,2500,"TCAE-09-CM",{"$f":"+Formulas!C24","v":{"$error":"#DIV/0!"}},"L dependant","336",null,"BC225 - F",{"$f":"+Formulas!D49","v":60},"TCAE-06-S",{"$f":"+Formulas!C49","v":{"$error":"#DIV/0!"}},30,244,null,null,"DOX 225F","TCAE-04-HD",3000]
["BJ095",{"v":186.20310213734226,"d":"186"},{"v":0.13457483486602362,"d":"0"},null,"BJ095 - R",130,147,"TCAE-1-R",{"$f":"+Formulas!C13","v":{"$error":"#DIV/0!"}},{"v":9.1,"d":"9"},"148",null,"BJ095 - L",147,1800,"TCAE-1-L",{"$f":"+Formulas!C13","v":{"$error":"#DIV/0!"}},"L dependant","148",null,"DOJ400 - CM",550,2500,"TCAE-10-CM",{"$f":"+Formulas!C25","v":{"$error":"#DIV/0!"}},"L dependant","376",null,"BC240 - F",{"$f":"+Formulas!D50","v":80},"TCAE-07-S",{"$f":"+Formulas!C50","v":{"$error":"#DIV/0!"}},39,272,null,null,"DOX 250F","TCAE-05-HD",3000]
["BJ125",{"v":462.7466972877206,"d":"463"},{"v":2.0655375894434926,"d":"2"},null,"BJ125 - R",136,162,"TCAE-2-R",{"$f":"+Formulas!C14","v":{"$error":"#DIV/0!"}},{"v":14.7,"d":"15"},"178",null,"BJ125 - L",162,2000,"TCAE-2-L",{"$f":"+Formulas!C14","v":{"$error":"#DIV/0!"}},"L dependant","178",null,"DOJ450 - CM",600,3000,"TCAE-11-CM",{"$f":"+Formulas!C26","v":{"$error":"#DIV/0!"}},"L dependant","420",null,"BC287 - F",{"$f":"+Formulas!D51","v":90},"TCAE-08-S",{"$f":"+Formulas!C51","v":{"$error":"#DIV/0!"}},50,292,null,null,"DOX 285F","TCAE-06-HD",3000]
["BJ150",{"v":782.1310755614405,"d":"782"},{"v":9.973365707081804,"d":"10"},null,"BJ150 - R",240,270,"TCAE-3-R",{"$f":"+Formulas!C15","v":{"$error":"#DIV/0!"}},{"v":31.5,"d":"32"},"215",null,"BJ150 - L",270,2000,"TCAE-3-L",{"$f":"+Formulas!C15","v":{"$error":"#DIV/0!"}},"L dependant","215",null,"DOJ500 - CM",650,3000,"TCAE-12-CM",{"$f":"+Formulas!C27","v":{"$error":"#DIV/0!"}},"L dependant","462",null,"BC350 - F",{"$f":"+Formulas!D52","v":130},"TCAE-09-S",{"$f":"+Formulas!C52","v":{"$error":"#DIV/0!"}},74,336,null,null,"DOX 300F","TCAE-07-HD",3000]
["BJ175",{"v":1183.875424308071,"d":"1184"},{"v":34.587656345792176,"d":"35"},null,"BJ175 - R",276,285,"TCAE-4-R",{"$f":"+Formulas!C16","v":{"$error":"#DIV/0!"}},{"v":45.5,"d":"46"},"253",null,"BJ175 - L",285,2000,"TCAE-4-L",{"$f":"+Formulas!C16","v":{"$error":"#DIV/0!"}},"L dependant","253",null,"DOJ550 - CM",700,3000,"TCAE-13-CM",{"$f":"+Formulas!C28","v":{"$error":"#DIV/0!"}},"L dependant","504",null,"BC410 - F",{"$f":"+Formulas!D53","v":145},"TCAE-10-S",{"$f":"+Formulas!C53","v":{"$error":"#DIV/0!"}},103,376,null,null,"DOX 315F","TCAE-08-HD",3000]
["BJ200",{"v":1856.4311221926196,"d":"1856"},{"v":133.36431576069475,"d":"133"},null,"BJ200 - R",276,300,"TCAE-5-R",{"$f":"+Formulas!C17","v":{"$error":"#DIV/0!"}},{"v":58.2,"d":"58"},"278",null,"BJ200 - L",300,2000,"TCAE-5-L",{"$f":"+Formulas!C17","v":{"$error":"#DIV/0!"}},"L dependant","278",null,"DOJ625 - CM",700,3000,"TCAE-14-CM",{"$f":"+Formulas!C29","v":{"$error":"#DIV/0!"}},"L dependant","580",null,"BC450 - F",{"$f":"+Formulas!D54","v":180},"TCAE-11-S",{"$f":"+Formulas!C54","v":{"$error":"#DIV/0!"}},137,420,null,null,"DOX 350F","TCAE-09-HD",3000]
["BJ225",{"v":2551.9291645602752,"d":"2552"},{"v":346.4247922475012,"d":"346"},null,"BJ225 - R",291,312,"TCAE-6-R",{"$f":"+Formulas!C18","v":{"$error":"#DIV/0!"}},74,"300",null,"BJ225 - L",312,2000,"TCAE-6-L",{"$f":"+Formulas!C18","v":{"$error":"#DIV/0!"}},"L dependant","300",null,"N/A",{"$nulls":7},"BC500 - F",{"$f":"+Formulas!D55","v":200},"TCAE-12-S",{"$f":"+Formulas!C55","v":{"$error":"#DIV/0!"}},181,462,null,null,"DOX 390F","TCAE-10-HD",3000]
{"$rows_left_out":50}
{"sheet":"Daves scratchpad 2","index":5,"n_rows":123,"n_cols":32,"rows_kept":123,"hidden":true,"merged":[[1,1,1,11],[3,1,3,6],[4,5,4,7],[4,18,4,31],[35,16,41,16],[35,17,35,18],[35,19,35,20],[35,22,35,23],[35,24,35,25],[36,17,36,18],[36,19,36,20],[36,22,36,23],[36,24,36,25],[37,17,37,18],[37,19,37,20],[37,22,37,23],[37,24,37,25],[38,17,38,18],[38,19,38,20],[38,22,38,23],[38,24,38,25],[39,17,39,18],[39,19,39,20],[39,22,39,23],[39,24,39,25],[40,17,40,18],[40,19,40,20],[40,22,40,23],[40,24,40,25],[41,17,41,18],[41,19,41,20],[41,22,41,23],[41,24,41,25],[42,17,42,18],[44,1,44,6],[45,4,45,17],[55,17,63,17],[83,20,83,21],[83,24,83,25],[84,16,84,17],[84,20,84,21],[84,24,84,25],[85,16,85,17],[85,20,85,21],[85,24,85,25],[86,16,86,17],[86,20,86,21],[86,24,86,25],[87,16,87,17],[87,20,87,21],[87,24,87,25],[88,16,88,17],[88,20,88,21],[89,16,89,17],[89,20,89,21],[90,16,90,17],[90,20,90,21],[90,24,90,25],[91,16,91,17],[91,20,91,21],[92,16,92,17],[92,20,92,21],[93,16,93,17],[93,20,93,21],[93,24,93,25],[94,16,94,17],[94,20,94,21],[95,16,95,17],[95,20,95,21],[96,16,96,17],[96,20,96,21],[97,16,97,17],[97,20,97,21],[98,1,98,6],[102,0,110,0],[114,0,122,0]]}
[null,"OBJECTIVE: "]
[2,"Determine the correlation between Service life data and strength data for BJ and DOJ to apply to BCF models"]
[]
[null,"BJ-D Series comparison of dynamic torque to life torques"]
[{"$nulls":5},"formulas",{"$nulls":5},"Rule 1","Rule 2",{"$nulls":5},"rpm"]
[null,"Model","static","dyn rev","dyn fwd","static ","dyn fwd","dyn rev",null,"rev/static","fwd/static","Dyn fwd","Dyn rev",null,"Model","static","dyn fwd","dyn rev",10,50,100,200,300,400,500,600,800,1000,1500,2000,3000,4000]
[1,"BJ75",1520,392,558,{"$f":"+(998.24*A7^2)-(2886.5*A7)+4599","v":{"v":2710.74,"d":"2,711"}},{"$f":"+(475.67*A7^2)-(1369.7*A7)+1952.2","v":{"v":1058.17,"d":"1,058"}},{"$f":"+(249.43*(A7^2))-(713.79*A7)+1147.6","v":{"v":683.24,"d":"683"}},null,{"$f":"+H7/F7","v":{"v":0.25204925592273697,"d":"0.252"}},{"$f":"+H7/G7","v":{"v":0.6456807507300338,"d":"0.646"}},{"$f":"+M7/0.54","v":{"v":703.7037037037037,"d":"704"}},{"$f":"0.25*C7","v":380},null,"BJ75",1520,558,392,285,209,183,160,151,140,134,129,122,117,102,93,81,74]
[2,"BJ95",2500,637,{"v":1127,"d":"1,127"},{"$f":"+(998.24*A8^2)-(2886.5*A8)+4599","v":{"v":2818.96,"d":"2,819"}},{"$f":"+(475.67*A8^2)-(1369.7*A8)+1952.2","v":{"v":1115.48,"d":"1,115"}},{"v":717.74,"d":"718"},null,{"$f":"+H8/F8","v":{"v":0.2546116298209269,"d":"0.255"}},{"$f":"+H8/G8","v":{"v":0.6434360096102126,"d":"0.643"}},{"v":1157.4074074074074,"d":"1,157"},625,null,"BJ95",2500,{"v":1127,"d":"1,127"},637,570,415,365,320,300,280,270,260,245,234,205,186,162,148]
[3,"BJ125",5780,1470,{"v":2744,"d":"2,744"},{"v":4923.66,"d":"4,924"},{"v":2124.129999999999,"d":"2,124"},{"v":1251.1,"d":"1251"},null,{"v":0.2540995925795039,"d":"0.254"},{"v":0.5889940822830996,"d":"0.589"},{"v":2675.9259259259256,"d":"2,676"},{"v":1445,"d":"1,445"},null,"BJ125",5780,{"v":2744,"d":"2,744"},1470,{"v":1350,"d":"1,350"},980,860,730,710,660,630,610,580,550,485,440,385,350]
[4,"BJ150",11564,2890,{"v":4704,"d":"4,704"},{"v":9024.84,"d":"9,025"},{"v":4084.12,"d":"4,084"},{"v":2283.32,"d":"2283"},null,{"v":0.2530039313716365,"d":"0.253"},{"v":0.5590727010959522,"d":"0.559"},{"v":5353.7037037037035,"d":"5,354"},{"v":2891,"d":"2,891"},null,"BJ150",11564,{"v":4704,"d":"4,704"},2890,{"v":2300,"d":"2,300"},1700,1450,1300,1200,1150,1100,1050,980,940,820,750,650,600]
[5,"BJ175",15680,4018,{"v":6713,"d":"6,713"},{"v":15122.5,"d":"15,123"},{"v":6995.45,"d":"6,995"},{"v":3814.4,"d":"3814"},null,{"v":0.2522334270127294,"d":"0.252"},{"v":0.5452687103760302,"d":"0.545"},{"v":7259.259259259259,"d":"7,259"},{"v":3920,"d":"3,920"},null,"BJ175",15680,{"v":6713,"d":"6,713"},4018,{"v":3650,"d":"3,650"},2650,2350,2050,1950,1800,1700,1650,1550,1500,1300,1200,1050,940]
[6,"BJ200",23912,5880,{"v":11172,"d":"11,172"},{"v":23216.64,"d":"23,217"},{"v":10858.119999999999,"d":"10,858"},{"v":5844.34,"d":"5844"},null,{"v":0.25173065525416255,"d":"0.252"},{"v":0.5382460315413718,"d":"0.538"},{"v":11070.37037037037,"d":"11,070"},{"v":5978,"d":"5,978"},null,"BJ200",23912,{"v":11172,"d":"11,172"},5880,{"v":5500,"d":"5,500"},4000,3500,3050,2900,2700,2550,2500,2350,2250,1950,1800,1550,1400]
[7,"BJ225",29694,7546,{"v":14700,"d":"14,700"},{"v":33307.26,"d":"33,307"},{"v":15672.130000000003,"d":"15,672"},{"v":8373.14,"d":"8373"},null,{"v":0.2513908379134158,"d":"0.251"},{"v":0.5342694324255859,"d":"0.534"},{"v":13747.22222222222,"d":"13,747"},{"v":7423.5,"d":"7,424"},null,"BJ225",29694,{"v":14700,"d":"14,700"},7546,{"v":7800,"d":"7,800"},5700,5000,4350,4150,3800,3650,3550,3350,3200,2800,2550,2200,2000]
[8,"BJ250",42238,10682,{"v":20678,"d":"20,678"},{"v":45394.36,"d":"45,394"},{"v":21437.48,"d":"21,437"},{"v":11400.800000000001,"d":"11401"},null,{"v":0.25115014288118614,"d":"0.251"},{"v":0.5318162395953256,"d":"0.532"},{"v":19554.629629629628,"d":"19,555"},{"v":10559.5,"d":"10,560"},null,"BJ250",42238,{"v":20678,"d":"20,678"},10682,{"v":10600,"d":"10,600"},7800,6800,6000,5700,5200,5000,4850,4600,4400,3800,3450,3050,2750]
[9,"BJ300",63112,15780,{"v":29106,"d":"29,106"},{"v":59477.94,"d":"59,478"},{"v":28154.170000000002,"d":"28,154"},{"v":14927.320000000002,"d":"14927"},null,{"v":0.25097237732174316,"d":"0.251"},{"v":0.5301992564511758,"d":"0.530"},{"v":29218.51851851852,"d":"29,219"},{"v":15778,"d":"15,778"},null,"BJ300",63112,{"v":29106,"d":"29,106"},15780,{"v":14100,"d":"14,100"},10300,9000,7900,7500,6900,6700,6300,6100,5800,5100,4600,4000,3650]
{"$rows_left_out":78}
{"sheet":" Daves scratchpad 1","index":6,"n_rows":52,"n_cols":34,"rows_kept":52,"hidden":true,"merged":[[2,1,2,11],[22,0,22,1],[22,5,22,6],[22,10,22,11],[22,15,22,16],[22,20,22,21],[22,25,22,26],[22,30,22,31],[43,2,43,5]]}
[]
[null,"OBJECTIVE: "]
[1,"Determine the optimum duty factor for TCAE based on real life failed coupling life"]
[]
[]
["Case 1 - Visy","PM3 turbo pump",{"$nulls":3},"Case 2 - Visy","PM6 turbo pump",{"$nulls":3},"Case 3 - CHH K1","Kiln 1 Fan 1",{"$nulls":3},"Case 4 - CHH K1","Kiln 6 Fan 8",{"$nulls":3},"Case 5 - CHH K1","Kiln7 Fan 7",{"$nulls":3},"Case 6 - CHH K1","Kiln 9 Fan 7",{"$nulls":3},"Case 7 - CHH K1","Kiln 10 Fan 3"]
["Motor",18.5,"kW",null,null,"Motor",22,"kW",null,null,"Motor",15,"kW",null,null,"Motor",15,"kW",null,null,"Motor",15,"kW",null,null,"Motor",15,"kW",null,null,"Motor",15,"kW"]
["speed",1440,"rpm",null,null,"speed",1450,"rpm",null,null,"speed",980,"rpm",null,null,"speed",980,"rpm",null,null,"speed",980,"rpm",null,null,"speed",980,"rpm",null,null,"speed",980,"rpm"]
["MSF",1.25,{"$nulls":3},"MSF",1.25,{"$nulls":3},"MSF",1.25,{"$nulls":3},"MSF",1.25,{"$nulls":3},"MSF",1.25,{"$nulls":3},"MSF",1.25,{"$nulls":3},"MSF",1.25]
["DCF",1.44,{"$nulls":3},"DCF",1.44,{"$nulls":3},"DCF",1.44,{"$nulls":3},"DCF",1.44,{"$nulls":3},"DCF",1.44,{"$nulls":3},"DCF",1.44,{"$nulls":3},"DCF",1.44]
["AF",0.95,{"$nulls":3},"AF",0.95,{"$nulls":3},"AF",0.95,{"$nulls":3},"AF",0.95,{"$nulls":3},"AF",0.95,{"$nulls":3},"AF",0.95,{"$nulls":3},"AF",0.95]
["Load capacity",{"v":0.8,"d":"80%"},{"$nulls":3},"Load capacity",{"v":0.8,"d":"80%"},{"$nulls":3},"Load capacity",{"v":0.8,"d":"80%"},{"$nulls":3},"Load capacity",{"v":0.8,"d":"80%"},{"$nulls":3},"Load capacity",{"v":0.8,"d":"80%"},{"$nulls":3},"Load capacity",{"v":0.8,"d":"80%"},{"$nulls":3},"Load capacity",{"v":0.8,"d":"80%"}]
["Original result","TCAE","Life hours","Life days",null,"Original result","TCAE","Life hours","Life days",null,"Original result","TCAE","Life hours","Life days",null,"Original result","TCAE","Life hours","Life days",null,"Original result","TCAE","Life hours","Life days",null,"Original result","TCAE","Life hours","Life days",null,"Original result","TCAE","Life hours","Life days"]
[null,"TCAE 1R",{"v":8842,"d":"8,842"},{"$f":"+C14/24","v":{"v":368.4166666666667,"d":"368"}},null,null,"TCAE 1R",{"v":5328,"d":"5,328"},222,null,null,"TCAE 1R",{"$nulls":4},"TCAE 1R",{"$nulls":4},"TCAE 1R",{"$nulls":4},"TCAE 1R",{"$nulls":4},"TCAE 1R"]
[null,"TCAE 2R",{"v":139678,"d":"139,678"},{"$f":"+C15/24","v":{"v":5819.916666666667,"d":"5,820"}},null,null,"TCAE 2R",{"v":84192,"d":"84,192"},{"v":3508,"d":"3,508"},null,null,"TCAE 2R",{"$nulls":4},"TCAE 2R",{"$nulls":4},"TCAE 2R",{"$nulls":4},"TCAE 2R",{"$nulls":4},"TCAE 2R"]
{"$rows_left_out":30}